program: Orca
programVersion: 5.0.3
elementType: Cl S O O O N N N N N C C C C C C C C H H H H H H H H H H
charge: 0
multiplicity: 1
keywords: wb97x-d3
keywords: def2-TZVPP
keywords: def2/J RIJCOSX
keywords: DEFGRID2
keywords: scfconv7
keywords: smallprint printgap noloewdin
keywords: NOSOSCF
formula: C8H10ClN5O3S
InChI: InChI=1/C8H10ClN5O3S/c1-12-4-17-5-13(8(12)11-14(15)16)3-6-2-10-7(9)18-6/h2H,3-5H2,1H3
28 atoms
Cl -4.816158 0.548798 0.843827
S  -1.88648 0.073536 0.813563
O  0.390176 2.115425 -1.138592
O  3.392164 -2.39971 1.500926
O  3.110621 -1.983038 -0.579567
N  1.019618 -0.076379 -0.761516
N  2.399811 1.584046 -0.026382
N  2.615971 -0.45722 0.969274
N  -3.501741 -0.948277 -0.886481
N  3.034086 -1.657601 0.602313
C  0.61353 0.881387 -1.763841
C  2.023256 0.312045 0.04198
C  0.215831 -1.26767 -0.527007
C  1.584468 2.626571 -0.649966
C  -1.237034 -0.947567 -0.419192
C  3.590722 2.075698 0.638837
C  -2.249079 -1.379771 -1.21382
C  -3.449274 -0.187876 0.1444
H  1.384842 0.961464 -2.538658
H  -0.313728 0.55788 -2.229527
H  0.545263 -1.7526 0.390227
H  0.350518 -1.98353 -1.339639
H  1.340935 3.382438 0.099684
H  2.187053 3.094277 -1.438727
H  3.360448 2.450422 1.63683
H  4.003521 2.892856 0.047778
H  4.341629 1.296719 0.716466
H  -2.114851 -2.02947 -2.067451
elementType: Cl S O N C H
totalener: -1668.68179525 hartree
nucrepener: 1655.19868165 hartree
electener: -3323.88047690 hartree
oneelecener: -5579.70071159 hartree
twoeener: 2255.82023468 hartree
cpcmener: -0.04514262 hartree
kineticenergy: 1664.23068597 hartree
xcener: -114.862303503436 hartree
chargesum: -0.0000000
charge: -0.025556 0.069594 -0.350441 -0.465048 -0.469647 -0.121013 -0.086346 -0.411808 -0.287161 0.564808 0.063752 0.313204 -0.015886 0.087594 -0.054058 -0.163772 -0.060671 0.087032 0.141513 0.133707 0.145915 0.136053 0.128263 0.124222 0.126504 0.114097 0.120214 0.154935
qa: -0.0256 0.0696 -0.3504 -0.4650 -0.4696 -0.1210 -0.0863 -0.4118 -0.2872 0.5648 0.0638 0.3132 -0.0159 0.0876 -0.0541 -0.1638 -0.0607 0.0870 0.1415 0.1337 0.1459 0.1361 0.1283 0.1242 0.1265 0.1141 0.1202 0.1549
va: 1.2805 2.7627 1.9894 1.7720 1.7825 3.2001 3.2650 2.7222 3.0420 4.2821 3.9659 4.2777 3.7902 3.9580 3.8016 3.8813 4.0732 4.2531 0.9880 0.9913 0.9904 0.9972 0.9829 0.9880 0.9900 0.9957 1.0023 1.0079
dispcorr: -0.013967720 hartree
energy: -1668.695762971753
dipole: 21.20990 -21.42460 -0.21470 7.59468 -4.14870 3.44598 -7.44741 5.79099 -1.65642
magnitude: 3.82944 au
magnitude: 9.73367 debye
