program: Orca
programVersion: 5.0.3
elementType: Cl S O O O N N N N N C C C C C C C C H H H H H H H H H H
charge: 0
multiplicity: 1
keywords: wb97x-d3
keywords: def2-TZVPP
keywords: def2/J RIJCOSX
keywords: DEFGRID2
keywords: scfconv7
keywords: smallprint printgap noloewdin
keywords: NOSOSCF
formula: C8H10ClN5O3S
InChI: InChI=1/C8H10ClN5O3S/c1-12-4-17-5-13(8(12)11-14(15)16)3-6-2-10-7(9)18-6/h2H,3-5H2,1H3
28 atoms
Cl -4.499561 -1.365971 -1.293043
S  -1.717458 -1.022147 -0.31937
O  1.626559 3.013252 0.416258
O  3.915336 -0.886256 0.694578
O  3.036658 -2.744273 0.090844
N  0.714598 0.918153 0.716232
N  2.453759 1.144679 -0.749733
N  1.788969 -0.98573 0.050328
N  -3.762047 -0.031804 0.860754
N  2.964274 -1.539985 0.274609
C  0.417901 2.312736 0.470995
C  1.713649 0.356952 0.023809
C  -0.104398 0.181239 1.658806
C  2.379106 2.603003 -0.673787
C  -1.464077 -0.089523 1.111132
C  3.378305 0.652044 -1.74997
C  -2.661986 0.340501 1.580692
C  -3.404986 -0.734573 -0.150197
H  -0.156896 2.433572 -0.455334
H  -0.167045 2.701706 1.302011
H  -0.209875 0.773918 2.569681
H  0.405337 -0.740624 1.929657
H  3.387716 2.998735 -0.54646
H  1.970261 2.974925 -1.621865
H  4.404925 0.648732 -1.385596
H  3.322809 1.308955 -2.61857
H  3.103091 -0.345381 -2.083088
H  -2.784891 0.947819 2.466726
elementType: Cl S O N C H
totalener: -1668.68453240 hartree
nucrepener: 1645.35635710 hartree
electener: -3314.04088950 hartree
oneelecener: -5560.12341308 hartree
twoeener: 2246.08252358 hartree
cpcmener: -0.04650146 hartree
kineticenergy: 1664.24592419 hartree
xcener: -114.865700700206 hartree
chargesum: -0.0000000
charge: -0.028622 0.068417 -0.351086 -0.472446 -0.468412 -0.098182 -0.068753 -0.414585 -0.285420 0.551284 0.077891 0.292753 -0.028479 0.090625 -0.021938 -0.175896 -0.081408 0.088341 0.130729 0.127991 0.139697 0.144993 0.130075 0.124398 0.130288 0.118828 0.125254 0.153662
qa: -0.0286 0.0684 -0.3511 -0.4724 -0.4684 -0.0982 -0.0688 -0.4146 -0.2854 0.5513 0.0779 0.2928 -0.0285 0.0906 -0.0219 -0.1759 -0.0814 0.0883 0.1307 0.1280 0.1397 0.1450 0.1301 0.1244 0.1303 0.1188 0.1253 0.1537
va: 1.2773 2.7792 2.0135 1.7759 1.7707 3.1864 3.2522 2.7077 3.0388 4.3247 3.9618 4.2887 3.8029 3.9488 3.7269 3.8859 4.0839 4.2565 0.9869 0.9879 0.9941 1.0064 0.9831 0.9888 0.9930 0.9978 0.9971 1.0080
dispcorr: -0.013714419 hartree
energy: -1668.698246818247
dipole: 18.76687 -19.42156 -0.65468 15.16799 -11.24302 3.92497 1.18388 -1.92432 -0.74044
magnitude: 4.04750 au
magnitude: 10.28793 debye
