program: Orca
programVersion: 5.0.3
elementType: Cl S O O O N N N N N C C C C C C C C H H H H H H H H H H
charge: 0
multiplicity: 1
keywords: wb97x-d3
keywords: def2-TZVPP
keywords: def2/J RIJCOSX
keywords: DEFGRID2
keywords: scfconv7
keywords: smallprint printgap noloewdin
keywords: NOSOSCF
formula: C8H10ClN5O3S
InChI: InChI=1/C8H10ClN5O3S/c1-12-4-17-5-13(8(12)11-14(15)16)3-6-2-10-7(9)18-6/h2H,3-5H2,1H3
28 atoms
Cl -3.947826 -1.403852 -1.517077
S  -2.203008 0.45003 0.009257
O  1.886022 3.246284 0.27024
O  2.159786 -2.776551 0.186741
O  1.370524 -1.411345 -1.264881
N  0.881767 1.281465 1.050247
N  2.474112 1.176599 -0.591369
N  1.962896 -0.705905 0.755072
N  -2.104908 -2.092219 0.242926
N  1.840214 -1.648094 -0.152695
C  0.800328 2.738001 0.967292
C  1.770582 0.566529 0.356839
C  -0.103791 0.61592 1.894339
C  2.095302 2.536626 -0.917039
C  -1.054846 -0.224102 1.110448
C  3.606602 0.577111 -1.26662
C  -1.161049 -1.57699 1.083882
C  -2.710803 -1.147225 -0.374526
H  -0.154128 3.017846 0.502049
H  0.833046 3.153393 1.975761
H  -0.633029 1.395479 2.444745
H  0.389525 -0.0096 2.637779
H  2.91078 3.011493 -1.456972
H  1.1999 2.541112 -1.549685
H  4.021157 -0.236328 -0.676407
H  4.384441 1.330292 -1.38043
H  3.335548 0.203297 -2.253472
H  -0.553103 -2.246926 1.675371
elementType: Cl S O N C H
totalener: -1668.68198021 hartree
nucrepener: 1697.95860412 hartree
electener: -3366.64058433 hartree
oneelecener: -5666.22619455 hartree
twoeener: 2299.58561021 hartree
cpcmener: -0.05002586 hartree
kineticenergy: 1664.24119666 hartree
xcener: -114.865223130585 hartree
chargesum: 0.0000000
charge: -0.026711 0.065697 -0.347459 -0.480832 -0.483582 -0.083863 -0.068338 -0.399196 -0.273799 0.572490 0.080211 0.248406 -0.006497 0.099690 -0.021906 -0.177372 -0.087357 0.084870 0.128746 0.127176 0.138582 0.137265 0.122956 0.126484 0.122758 0.117402 0.131126 0.153050
qa: -0.0267 0.0657 -0.3475 -0.4808 -0.4836 -0.0839 -0.0683 -0.3992 -0.2738 0.5725 0.0802 0.2484 -0.0065 0.0997 -0.0219 -0.1774 -0.0874 0.0849 0.1287 0.1272 0.1386 0.1373 0.1230 0.1265 0.1228 0.1174 0.1311 0.1531
va: 1.2786 2.7587 2.0107 1.7523 1.7548 3.1897 3.2488 2.7282 3.0390 4.2591 3.9645 4.3871 3.8044 3.9379 3.7339 3.8809 4.0804 4.2592 0.9836 0.9888 0.9951 1.0103 0.9854 0.9922 0.9981 0.9989 0.9893 1.0163
dispcorr: -0.015436670 hartree
energy: -1668.697416879393
dipole: 20.18588 -19.95011 0.23577 13.72353 -8.58290 5.14063 4.16173 -3.47957 0.68215
magnitude: 5.19105 au
magnitude: 13.19460 debye
