program: Orca
programVersion: 5.0.3
elementType: Cl S O O O N N N N N C C C C C C C C H H H H H H H H H H
charge: 0
multiplicity: 1
keywords: wb97x-d3
keywords: def2-TZVPP
keywords: def2/J RIJCOSX
keywords: DEFGRID2
keywords: scfconv7
keywords: smallprint printgap noloewdin
keywords: NOSOSCF
formula: C8H10ClN5O3S
InChI: InChI=1/C8H10ClN5O3S/c1-12-4-17-5-13(8(12)11-14(15)16)3-6-2-10-7(9)18-6/h2H,3-5H2,1H3
28 atoms
Cl -4.158645 -1.924443 -1.287129
S  -1.503744 -1.258247 -0.147199
O  1.849031 3.040333 0.754058
O  2.465732 -2.753395 -0.528902
O  3.698826 -1.215698 0.319448
N  0.705911 1.053775 0.879411
N  2.424914 1.195816 -0.610711
N  1.508593 -0.902511 0.079873
N  -3.705994 -0.225963 0.681215
N  2.630265 -1.652245 -0.070865
C  0.577597 2.468119 0.669252
C  1.616609 0.406441 0.123108
C  -0.167184 0.33088 1.780887
C  2.666738 2.594422 -0.27136
C  -1.439836 -0.104637 1.136257
C  3.190704 0.715747 -1.738711
C  -2.699965 0.314345 1.423417
C  -3.215149 -1.052124 -0.168072
H  0.106563 2.685227 -0.299967
H  -0.039205 2.895123 1.457509
H  -0.410015 0.986781 2.61994
H  0.379642 -0.51974 2.185027
H  3.700595 2.722873 0.061467
H  2.524887 3.180753 -1.191935
H  4.217626 0.469138 -1.471215
H  3.201414 1.495712 -2.501823
H  2.718255 -0.158967 -2.179456
H  -2.943425 1.032121 2.195305
totalener: -1668.65301283 hartree
nucrepener: 1658.60328665 hartree
electener: -3327.25629948 hartree
oneelecener: -5587.11147075 hartree
twoeener: 2259.85517126 hartree
kineticenergy: 1664.29070364 hartree
xcener: -114.867888346934 hartree
chargesum: 0.0000000
charge: -0.024653 0.109237 -0.304868 -0.335757 -0.384689 -0.104157 -0.125608 -0.363096 -0.237544 0.459373 0.060776 0.321055 -0.066883 0.081483 -0.021791 -0.193345 -0.084441 0.075464 0.111946 0.100437 0.114714 0.135085 0.108502 0.097296 0.143337 0.092865 0.122998 0.112263
qa: -0.0247 0.1092 -0.3049 -0.3358 -0.3847 -0.1042 -0.1256 -0.3631 -0.2375 0.4594 0.0608 0.3211 -0.0669 0.0815 -0.0218 -0.1933 -0.0844 0.0755 0.1119 0.1004 0.1147 0.1351 0.1085 0.0973 0.1433 0.0929 0.1230 0.1123
va: 1.2804 2.8094 2.0378 1.9167 1.8565 3.1131 3.1912 2.7060 3.0626 4.4311 4.0201 4.2390 3.8364 3.9890 3.6721 3.9073 4.1039 4.2522 0.9885 0.9921 0.9959 1.0122 0.9842 0.9888 0.9886 1.0024 0.9983 1.0153
dispcorr: -0.013682316 hartree
energy: -1668.666695150369
dipole: 18.32126 -18.04743 0.27383 17.80235 -15.16815 2.63420 2.33974 -2.44612 -0.10639
magnitude: 2.65053 au
magnitude: 6.73712 debye
