program: Orca
programVersion: 5.0.3
elementType: Cl S O O O N N N N N C C C C C C C C H H H H H H H H H H
charge: 0
multiplicity: 1
keywords: wb97x-d3
keywords: def2-TZVPP
keywords: def2/J RIJCOSX
keywords: DEFGRID2
keywords: scfconv7
keywords: smallprint printgap noloewdin
keywords: NOSOSCF
formula: C8H10ClN5O3S
InChI: InChI=1/C8H10ClN5O3S/c1-12-4-17-5-13(8(12)11-14(15)16)3-6-2-10-7(9)18-6/h2H,3-5H2,1H3
28 atoms
Cl -4.999547 -0.605966 0.878651
S  -2.804401 0.580239 -0.727517
O  1.446579 2.90491 0.403465
O  2.806719 -2.893343 0.19907
O  3.910903 -1.320369 -0.754285
N  0.851538 0.959984 -0.788488
N  2.820853 1.040221 0.361091
N  1.769754 -1.031191 -0.201477
N  -2.582957 -1.622372 0.544603
N  2.908134 -1.77423 -0.235045
C  0.485598 2.318401 -0.405136
C  1.863306 0.27651 -0.201648
C  -0.129315 0.256499 -1.594089
C  2.727292 2.44596 0.077164
C  -1.297789 -0.262765 -0.812861
C  3.697825 0.565912 1.412209
C  -1.387864 -1.400222 -0.071477
C  -3.40438 -0.674431 0.289638
H  0.327733 2.886133 -1.334983
H  -0.452899 2.317613 0.158102
H  0.36713 -0.572693 -2.092549
H  -0.465691 0.942494 -2.376782
H  3.440675 2.986431 0.694614
H  2.963153 2.636562 -0.977923
H  3.783701 1.339168 2.175011
H  4.689762 0.317443 1.038769
H  3.275687 -0.313366 1.894912
H  -0.577371 -2.103119 0.053439
totalener: -1668.65106301 hartree
nucrepener: 1638.80858781 hartree
electener: -3307.45965082 hartree
oneelecener: -5547.40352756 hartree
twoeener: 2239.94387674 hartree
kineticenergy: 1664.27799263 hartree
xcener: -114.863121327790 hartree
chargesum: -0.0000000
charge: -0.018947 0.044161 -0.305372 -0.337224 -0.379437 -0.121379 -0.125631 -0.355156 -0.224185 0.470478 0.092480 0.322834 -0.055018 0.049959 -0.063669 -0.190817 -0.041853 0.073204 0.095236 0.098720 0.132503 0.121715 0.100977 0.110348 0.097540 0.142223 0.119294 0.147014
qa: -0.0189 0.0442 -0.3054 -0.3372 -0.3794 -0.1214 -0.1256 -0.3552 -0.2242 0.4705 0.0925 0.3228 -0.0550 0.0500 -0.0637 -0.1908 -0.0419 0.0732 0.0952 0.0987 0.1325 0.1217 0.1010 0.1103 0.0975 0.1422 0.1193 0.1470
va: 1.2854 2.7463 2.0318 1.9141 1.8631 3.1025 3.1984 2.7048 3.0746 4.4138 3.9816 4.2562 3.8275 4.0253 3.6485 3.9036 4.0787 4.2526 0.9857 0.9975 1.0198 0.9981 0.9895 0.9908 0.9994 0.9837 0.9982 1.0345
dispcorr: -0.013868984 hartree
energy: -1668.664931989441
dipole: 23.43329 -23.41868 0.01462 10.69251 -7.84388 2.84864 -1.45176 0.97852 -0.47324
magnitude: 2.88772 au
magnitude: 7.33999 debye
