program: Orca
programVersion: 5.0.3
elementType: Cl S N N N N C C C C C C C C C C H H H H H H H H H
charge: 0
multiplicity: 1
keywords: wb97x-d3
keywords: def2-TZVPP
keywords: def2/J RIJCOSX
keywords: DEFGRID2
keywords: scfconv7
keywords: smallprint printgap noloewdin
keywords: NOSOSCF
formula: C10H9ClN4S
InChI: InChI=1/C10H9ClN4S/c11-9-2-1-8(5-13-9)6-15-3-4-16-10(15)14-7-12/h1-2,5H,3-4,6H2
25 atoms
Cl 4.967237 -0.198375 0.811886
S  -3.392562 0.553747 0.989251
N  -1.407233 0.725696 -0.629687
N  -2.40113 -1.351807 -0.682007
N  3.154187 1.020665 -0.595927
N  -4.047018 -3.001279 0.125793
C  -1.533729 2.081232 -0.122247
C  -0.408029 0.417505 -1.637795
C  -2.278411 1.979038 1.195779
C  -2.323172 -0.140911 -0.216934
C  0.944521 0.203971 -1.019077
C  1.230314 -0.938342 -0.274574
C  1.949782 1.149005 -1.145583
C  2.476591 -1.085478 0.301296
C  3.391126 -0.060825 0.100695
C  -3.291413 -2.190245 -0.218018
H  -2.078511 2.69507 -0.844361
H  -0.54666 2.518867 0.025367
H  -0.377471 1.245907 -2.348218
H  -0.727737 -0.46699 -2.186883
H  -1.607299 1.782906 2.030452
H  -2.860775 2.87236 1.407039
H  0.485712 -1.715056 -0.148094
H  1.782673 2.052842 -1.72197
H  2.728677 -1.962177 0.880706
elementType: Cl S N C H
totalener: -1463.95849354 hartree
nucrepener: 1228.79417155 hartree
electener: -2692.75266509 hartree
oneelecener: -4445.35936175 hartree
twoeener: 1752.60669667 hartree
cpcmener: -0.03855478 hartree
kineticenergy: 1460.04864394 hartree
xcener: -98.988293440918 hartree
chargesum: -0.0000000
charge: -0.085727 -0.046216 -0.074085 -0.431573 -0.323992 -0.234012 -0.055128 -0.013263 -0.106479 0.295810 -0.025808 -0.113548 0.001518 -0.178581 0.198946 0.006868 0.117511 0.116815 0.133716 0.129544 0.120859 0.127745 0.154879 0.134963 0.149237
qa: -0.0857 -0.0462 -0.0741 -0.4316 -0.3240 -0.2340 -0.0551 -0.0133 -0.1065 0.2958 -0.0258 -0.1135 0.0015 -0.1786 0.1989 0.0069 0.1175 0.1168 0.1337 0.1295 0.1209 0.1277 0.1549 0.1350 0.1492
va: 1.2161 2.3954 3.2405 2.9048 3.0472 3.1273 3.9281 3.7878 3.9493 4.0938 3.6439 3.9667 4.0523 3.9928 4.1256 4.3664 1.0012 0.9973 0.9968 1.0227 1.0113 1.0103 1.0067 1.0082 1.0047
dispcorr: -0.011264588 hartree
energy: -1463.969758124217
dipole: -9.60253 10.49245 0.88991 8.69334 -5.06118 3.63216 -3.74615 3.37651 -0.36964
magnitude: 3.75781 au
magnitude: 9.55161 debye
