program: Orca
programVersion: 5.0.3
elementType: Cl S N N N N C C C C C C C C C C H H H H H H H H H
charge: 0
multiplicity: 1
keywords: wb97x-d3
keywords: def2-TZVPP
keywords: def2/J RIJCOSX
keywords: DEFGRID2
keywords: scfconv7
keywords: smallprint printgap noloewdin
keywords: NOSOSCF
formula: C10H9ClN4S
InChI: InChI=1/C10H9ClN4S/c11-9-2-1-8(5-13-9)6-15-3-4-16-10(15)14-7-12/h1-2,5H,3-4,6H2
25 atoms
Cl 4.853319 -0.388695 0.786596
S  -3.242933 0.514955 1.115036
N  -1.464667 0.884818 -0.717337
N  -2.231606 -1.287596 -0.649866
N  3.076815 1.031766 -0.46791
N  -3.786477 -3.013932 0.208656
C  -1.384049 2.09307 0.074601
C  -0.445378 0.592751 -1.708127
C  -2.730211 2.223433 0.768549
C  -2.248715 -0.08111 -0.205198
C  0.888606 0.278876 -1.089011
C  1.162172 -0.966713 -0.525124
C  1.892244 1.233358 -1.029592
C  2.39164 -1.191245 0.060187
C  3.307524 -0.144043 0.057181
C  -3.07794 -2.180957 -0.169327
H  -1.191658 2.950054 -0.572836
H  -0.56902 2.030185 0.803783
H  -0.361739 1.461472 -2.365191
H  -0.800531 -0.240009 -2.313527
H  -2.658735 2.780226 1.699832
H  -3.471698 2.698378 0.126922
H  0.416628 -1.751688 -0.548704
H  1.739589 2.217463 -1.463821
H  2.639964 -2.145211 0.502099
totalener: -1463.92728448 hartree
nucrepener: 1236.04912052 hartree
electener: -2699.97640500 hartree
oneelecener: -4460.51186317 hartree
twoeener: 1760.53545817 hartree
kineticenergy: 1460.08490623 hartree
xcener: -98.990876612952 hartree
chargesum: -0.0000000
charge: -0.056844 0.008157 -0.106657 -0.406404 -0.260861 -0.093849 -0.073477 -0.048573 -0.139258 0.288223 -0.048333 -0.101821 -0.019835 -0.166157 0.189666 -0.037901 0.096307 0.107779 0.123108 0.129804 0.113341 0.110774 0.158263 0.102758 0.131790
qa: -0.0568 0.0082 -0.1067 -0.4064 -0.2609 -0.0938 -0.0735 -0.0486 -0.1393 0.2882 -0.0483 -0.1018 -0.0198 -0.1662 0.1897 -0.0379 0.0963 0.1078 0.1231 0.1298 0.1133 0.1108 0.1583 0.1028 0.1318
va: 1.2434 2.4206 3.1382 2.9155 3.0807 3.1358 3.9416 3.8130 3.9973 4.0851 3.5493 3.9602 4.0891 4.0098 4.1393 4.2960 0.9966 0.9962 0.9958 1.0247 1.0107 1.0064 1.0105 1.0098 1.0130
dispcorr: -0.011493982 hartree
energy: -1463.938778460814
dipole: -10.41494 10.73899 0.32404 9.82815 -7.23488 2.59326 -4.73322 4.31130 -0.42192
magnitude: 2.64727 au
magnitude: 6.72883 debye
