program: Orca
programVersion: 5.0.2
elementType: S F F F O N N N C C C C C C C C C C H H H H H H H H H H
charge: 0
multiplicity: 1
keywords: wb97x-d3
keywords: def2-TZVPP
keywords: def2/J RIJCOSX
keywords: DEFGRID2
keywords: scfconv7
keywords: smallprint printgap noloewdin
keywords: NOSOSCF
formula: C10H10F3N3OS
InChI: InChI=1/C10H10F3N3OS/c1-7(18(2,17)16-6-14)8-3-4-9(15-5-8)10(11,12)13/h3-5,7H,1-2H3
28 atoms
S  -2.451636 0.555637 0.231355
F  4.642428 0.533434 0.291127
F  3.993055 -1.086819 1.547559
F  4.525126 -1.466714 -0.498835
O  -1.782025 1.715182 0.824296
N  -3.904139 0.764784 -0.349918
N  1.733306 -1.441785 -0.038154
N  -5.668756 1.646636 1.141211
C  -1.547654 -0.038651 -1.226508
C  -0.099202 -0.13894 -0.842571
C  -2.174725 -1.290289 -1.814842
C  -2.471202 -0.751669 1.430915
C  0.722109 0.976297 -0.918626
C  0.465544 -1.331121 -0.396467
C  2.052898 0.870556 -0.54885
C  2.497716 -0.361786 -0.110572
C  3.922675 -0.589192 0.310029
C  -4.812372 1.228042 0.475097
H  -1.677201 0.798114 -1.920873
H  -3.191453 -1.096283 -2.146191
H  -1.589521 -1.580793 -2.686632
H  -2.187519 -2.132961 -1.126688
H  -1.453643 -0.94676 1.765042
H  -3.06754 -0.395324 2.271631
H  -2.92334 -1.645436 1.00947
H  0.335334 1.920482 -1.278673
H  -0.125654 -2.235629 -0.324491
H  2.703905 1.730383 -0.608675
elementType: S F O N C H
totalener: -1324.37195850 hartree
nucrepener: 1498.15821486 hartree
electener: -2822.53017336 hartree
oneelecener: -4793.39948956 hartree
twoeener: 1970.86931620 hartree
cpcmener: -0.05475417 hartree
kineticenergy: 1319.96759066 hartree
xcener: -101.933728589995 hartree
chargesum: -0.0000000
charge: 0.768583 -0.176599 -0.175619 -0.176553 -0.539113 -0.440128 -0.360053 -0.261357 0.128164 -0.053205 -0.301302 -0.249531 -0.126984 0.010784 -0.098458 0.106095 0.502221 0.011997 0.143943 0.119977 0.132256 0.108646 0.159907 0.160469 0.154874 0.159263 0.140577 0.151145
qa: 0.7686 -0.1766 -0.1756 -0.1766 -0.5391 -0.4401 -0.3601 -0.2614 0.1282 -0.0532 -0.3013 -0.2495 -0.1270 0.0108 -0.0985 0.1061 0.5022 0.0120 0.1439 0.1200 0.1323 0.1086 0.1599 0.1605 0.1549 0.1593 0.1406 0.1511
va: 5.2224 1.1269 1.1256 1.1226 1.9257 2.7714 3.0823 3.0865 3.7041 3.6611 3.9656 3.8993 4.0318 4.0686 3.9422 3.8507 4.5184 4.3777 1.0213 1.0123 0.9931 0.9986 1.0007 1.0052 0.9999 1.0039 1.0011 1.0042
dispcorr: -0.013954982 hartree
energy: -1324.385913481975
dipole: -24.61332 26.15179 1.53847 -3.29771 1.30378 -1.99393 -6.15106 4.22811 -1.92294
magnitude: 3.16865 au
magnitude: 8.05408 debye
