program: Orca
programVersion: 5.0.2
elementType: S F F F O N N N C C C C C C C C C C H H H H H H H H H H
charge: 0
multiplicity: 1
keywords: wb97x-d3
keywords: def2-TZVPP
keywords: def2/J RIJCOSX
keywords: DEFGRID2
keywords: scfconv7
keywords: smallprint printgap noloewdin
keywords: NOSOSCF
formula: C10H10F3N3OS
InChI: InChI=1/C10H10F3N3OS/c1-7(18(2,17)16-6-14)8-3-4-9(15-5-8)10(11,12)13/h3-5,7H,1-2H3
28 atoms
S  -2.775934 -0.1997 -0.326864
F  4.517858 -1.086559 -0.176773
F  3.892706 0.531564 -1.443972
F  4.323195 0.900088 0.631701
O  -4.153253 -0.695363 -0.289053
N  -2.50202 1.251393 0.222001
N  1.816854 -1.293302 -0.52628
N  -3.858567 3.145295 -0.605497
C  -1.709078 -1.237596 0.70728
C  -0.272176 -0.843184 0.547744
C  -2.245117 -1.20836 2.129877
C  -2.166262 -0.33065 -1.988583
C  0.297068 0.22516 1.225409
C  0.543788 -1.57394 -0.31206
C  1.631722 0.527166 1.009593
C  2.338066 -0.261226 0.120321
C  3.776706 0.022075 -0.211477
C  -3.236739 2.229724 -0.24771
H  -1.865251 -2.232179 0.276566
H  -2.19121 -0.218806 2.578573
H  -3.275101 -1.556702 2.171661
H  -1.643224 -1.888698 2.72987
H  -2.820584 0.277447 -2.614237
H  -1.147958 0.044578 -2.046167
H  -2.218094 -1.372298 -2.301335
H  -0.277748 0.824953 1.916881
H  0.140636 -2.427468 -0.846207
H  2.087979 1.358178 1.527418
elementType: S F O N C H
totalener: -1324.37260488 hartree
nucrepener: 1507.40099653 hartree
electener: -2831.77360141 hartree
oneelecener: -4811.87930821 hartree
twoeener: 1980.10570680 hartree
cpcmener: -0.05356271 hartree
kineticenergy: 1319.96747318 hartree
xcener: -101.935060257449 hartree
chargesum: 0.0000000
charge: 0.742438 -0.174182 -0.177543 -0.177009 -0.537948 -0.423372 -0.354873 -0.259392 0.131148 -0.073829 -0.295868 -0.244222 -0.094328 0.006071 -0.115526 0.110511 0.502744 0.007336 0.151163 0.113088 0.115065 0.125193 0.162777 0.151740 0.162419 0.155070 0.140968 0.150361
qa: 0.7424 -0.1742 -0.1775 -0.1770 -0.5379 -0.4234 -0.3549 -0.2594 0.1311 -0.0738 -0.2959 -0.2442 -0.0943 0.0061 -0.1155 0.1105 0.5027 0.0073 0.1512 0.1131 0.1151 0.1252 0.1628 0.1517 0.1624 0.1551 0.1410 0.1504
va: 5.2266 1.1286 1.1184 1.1260 1.9352 2.7777 3.0728 3.0946 3.6912 3.6526 3.9734 3.8904 4.0024 4.0791 3.9968 3.8506 4.5148 4.3848 1.0103 1.0043 1.0114 0.9965 1.0043 0.9976 1.0013 1.0048 1.0045 1.0053
dispcorr: -0.014155402 hartree
energy: -1324.386760280143
dipole: -24.12661 25.28570 1.15910 -6.95382 3.87296 -3.08086 4.27654 -3.55392 0.72262
magnitude: 3.37007 au
magnitude: 8.56604 debye
