program: Orca
programVersion: 5.0.2
elementType: S F F F O N N N C C C C C C C C C C H H H H H H H H H H
charge: 0
multiplicity: 1
keywords: wb97x-d3
keywords: def2-TZVPP
keywords: def2/J RIJCOSX
keywords: DEFGRID2
keywords: scfconv7
keywords: smallprint printgap noloewdin
keywords: NOSOSCF
formula: C10H10F3N3OS
InChI: InChI=1/C10H10F3N3OS/c1-7(18(2,17)16-6-14)8-3-4-9(15-5-8)10(11,12)13/h3-5,7H,1-2H3
28 atoms
S  -2.792729 0.312442 -0.529414
F  4.021985 1.271551 -0.652626
F  4.087488 0.368201 1.298775
F  4.544361 -0.801759 -0.446637
O  -4.197768 -0.078357 -0.667878
N  -2.419122 1.310325 0.634792
N  1.537609 -0.148492 0.965296
N  -3.192743 0.905763 2.947152
C  -1.78364 -1.216233 -0.441798
C  -0.329785 -0.864605 -0.34487
C  -2.313781 -2.10815 0.671995
C  -2.219223 1.175897 -1.956192
C  0.485031 -0.9383 -1.466862
C  0.256809 -0.466259 0.852853
C  1.82569 -0.616069 -1.358345
C  2.293714 -0.223184 -0.116652
C  3.742747 0.155965 0.03428
C  -2.851556 1.047026 1.844626
H  -1.981044 -1.689199 -1.409193
H  -1.75087 -3.039928 0.644709
H  -2.195517 -1.677314 1.663725
H  -3.361991 -2.353667 0.518583
H  -2.847293 2.0588 -2.064081
H  -1.180719 1.468598 -1.828409
H  -2.335157 0.524483 -2.820055
H  0.076407 -1.249586 -2.419625
H  -0.319587 -0.410409 1.768172
H  2.47532 -0.672482 -2.220979
elementType: S F O N C H
totalener: -1324.37175596 hartree
nucrepener: 1516.64532922 hartree
electener: -2841.01708518 hartree
oneelecener: -4830.74050272 hartree
twoeener: 1989.72341754 hartree
cpcmener: -0.05760160 hartree
kineticenergy: 1319.95960759 hartree
xcener: -101.931440710180 hartree
chargesum: -0.0000000
charge: 0.757350 -0.180943 -0.168936 -0.180639 -0.534838 -0.427423 -0.350645 -0.252494 0.040438 -0.042915 -0.269086 -0.230066 -0.103686 0.015595 -0.138323 0.121425 0.515937 0.020278 0.144978 0.125815 0.103149 0.119955 0.160340 0.153099 0.157090 0.161147 0.125138 0.158260
qa: 0.7574 -0.1809 -0.1689 -0.1806 -0.5348 -0.4274 -0.3506 -0.2525 0.0404 -0.0429 -0.2691 -0.2301 -0.1037 0.0156 -0.1383 0.1214 0.5159 0.0203 0.1450 0.1258 0.1031 0.1200 0.1603 0.1531 0.1571 0.1611 0.1251 0.1583
va: 5.2122 1.1132 1.1400 1.1170 1.9367 2.7591 3.0782 3.0879 3.7858 3.5888 3.9442 3.8802 3.9732 4.1051 4.0176 3.8326 4.5011 4.3607 1.0149 0.9956 1.0091 1.0134 1.0107 0.9983 1.0012 0.9955 1.0093 1.0037
dispcorr: -0.014737942 hartree
energy: -1324.386493899681
dipole: -24.37505 25.11277 0.73771 -7.32959 5.56429 -1.76530 -7.91655 2.84153 -5.07501
magnitude: 5.42368 au
magnitude: 13.78589 debye
