program: Orca
programVersion: 5.0.2
elementType: S F F F O N N N C C C C C C C C C C H H H H H H H H H H
charge: 0
multiplicity: 1
keywords: wb97x-d3
keywords: def2-TZVPP
keywords: def2/J RIJCOSX
keywords: DEFGRID2
keywords: scfconv7
keywords: smallprint printgap noloewdin
keywords: NOSOSCF
formula: C10H10F3N3OS
InChI: InChI=1/C10H10F3N3OS/c1-7(18(2,17)16-6-14)8-3-4-9(15-5-8)10(11,12)13/h3-5,7H,1-2H3
28 atoms
S  -2.812514 -0.428068 -0.455647
F  4.299274 -1.012548 -0.745247
F  3.926417 1.091912 -0.987917
F  4.43157 0.309334 0.947086
O  -4.217358 -0.645292 -0.102486
N  -2.407987 0.981675 -1.033217
N  1.798227 -1.377488 0.019323
N  -3.138871 3.075266 0.058115
C  -1.779067 -0.856554 0.99974
C  -0.342546 -0.547931 0.704651
C  -2.355141 -0.169024 2.229136
C  -2.300576 -1.521845 -1.739928
C  0.187406 0.73235 0.823263
C  0.516504 -1.564287 0.300916
C  1.52334 0.937694 0.534979
C  2.279093 -0.151902 0.13238
C  3.741508 0.047343 -0.171639
C  -2.814842 2.062197 -0.412954
H  -1.914381 -1.93905 1.089306
H  -2.349088 0.917107 2.159341
H  -3.372551 -0.498702 2.424711
H  -1.745964 -0.451262 3.086678
H  -2.451946 -2.543294 -1.39666
H  -2.935181 -1.318305 -2.601517
H  -1.258042 -1.34951 -1.994223
H  -0.417607 1.56946 1.145816
H  0.146267 -2.579382 0.205908
H  1.953639 1.925726 0.623802
elementType: S F O N C H
totalener: -1324.37227526 hartree
nucrepener: 1516.63316110 hartree
electener: -2841.00543636 hartree
oneelecener: -4830.62535169 hartree
twoeener: 1989.61991533 hartree
cpcmener: -0.05255486 hartree
kineticenergy: 1319.94199894 hartree
xcener: -101.928750603188 hartree
chargesum: -0.0000000
charge: 0.760513 -0.168943 -0.180093 -0.180922 -0.535389 -0.424770 -0.349169 -0.255144 0.041235 -0.024551 -0.270605 -0.230022 -0.102213 0.009531 -0.166132 0.126652 0.513726 0.023032 0.146964 0.104956 0.118974 0.126118 0.155787 0.157978 0.153248 0.150092 0.141927 0.157218
qa: 0.7605 -0.1689 -0.1801 -0.1809 -0.5354 -0.4248 -0.3492 -0.2551 0.0412 -0.0246 -0.2706 -0.2300 -0.1022 0.0095 -0.1661 0.1267 0.5137 0.0230 0.1470 0.1050 0.1190 0.1261 0.1558 0.1580 0.1532 0.1501 0.1419 0.1572
va: 5.2099 1.1405 1.1185 1.1122 1.9367 2.7649 3.0555 3.0851 3.7898 3.6091 3.9468 3.8811 4.0151 4.0706 4.0808 3.8367 4.5025 4.3582 1.0114 1.0076 1.0136 0.9961 1.0012 1.0114 1.0004 1.0017 1.0030 1.0050
dispcorr: -0.014732426 hartree
energy: -1324.387007681758
dipole: -25.17999 25.55619 0.37620 -6.27363 2.97017 -3.30347 5.15951 -4.77826 0.38125
magnitude: 3.34661 au
magnitude: 8.50640 debye
