program: Orca
programVersion: 5.0.2
elementType: S F F F O N N N C C C C C C C C C C H H H H H H H H H H
charge: 0
multiplicity: 1
keywords: wb97x-d3
keywords: def2-TZVPP
keywords: def2/J RIJCOSX
keywords: DEFGRID2
keywords: scfconv7
keywords: smallprint printgap noloewdin
keywords: NOSOSCF
formula: C10H10F3N3OS
InChI: InChI=1/C10H10F3N3OS/c1-7(18(2,17)16-6-14)8-3-4-9(15-5-8)10(11,12)13/h3-5,7H,1-2H3
28 atoms
S  -2.496084 0.078186 0.542666
F  4.004334 -0.889743 1.504427
F  4.530442 -1.368312 -0.524912
F  4.635538 0.667977 0.167206
O  -1.838499 0.658638 1.712096
N  -4.028159 0.372292 0.325502
N  1.951513 0.873217 0.30738
N  -4.888198 2.684361 0.469001
C  -1.559726 0.593557 -0.947677
C  -0.115298 0.256987 -0.722627
C  -2.193757 0.042723 -2.210135
C  -2.46219 -1.684686 0.599312
C  0.473148 -0.896572 -1.218554
C  0.685295 1.116667 0.031369
C  1.807093 -1.155491 -0.94001
C  2.492807 -0.239249 -0.165663
C  3.925701 -0.457253 0.24018
C  -4.438925 1.616398 0.404206
H  -1.686723 1.682222 -0.919287
H  -3.225723 0.37418 -2.306575
H  -1.643912 0.428919 -3.068078
H  -2.177014 -1.044586 -2.264893
H  -3.048626 -1.978817 1.469646
H  -2.899011 -2.108168 -0.301456
H  -1.431836 -2.010833 0.724652
H  -0.086729 -1.601165 -1.819252
H  0.278528 2.045058 0.416034
H  2.276226 -2.050746 -1.322387
elementType: S F O N C H
totalener: -1324.37508766 hartree
nucrepener: 1502.53644492 hartree
electener: -2826.91153257 hartree
oneelecener: -4802.38577225 hartree
twoeener: 1975.47423967 hartree
cpcmener: -0.04925347 hartree
kineticenergy: 1319.97360208 hartree
xcener: -101.934037670783 hartree
chargesum: -0.0000000
charge: 0.784956 -0.176137 -0.177265 -0.170683 -0.518813 -0.454830 -0.344666 -0.236885 0.058222 -0.044995 -0.297245 -0.233713 -0.121898 -0.002981 -0.105379 0.105672 0.502984 0.015258 0.153890 0.121383 0.129334 0.104488 0.158542 0.153486 0.152241 0.159806 0.134173 0.151056
qa: 0.7850 -0.1761 -0.1773 -0.1707 -0.5188 -0.4548 -0.3447 -0.2369 0.0582 -0.0450 -0.2972 -0.2337 -0.1219 -0.0030 -0.1054 0.1057 0.5030 0.0153 0.1539 0.1214 0.1293 0.1045 0.1585 0.1535 0.1522 0.1598 0.1342 0.1511
va: 5.2103 1.1190 1.1252 1.1334 1.9541 2.7475 3.0801 3.0919 3.7754 3.6401 3.9618 3.8840 3.9710 4.1313 3.9924 3.8579 4.5143 4.3558 1.0042 1.0084 0.9949 0.9983 1.0114 1.0017 0.9986 0.9939 1.0160 1.0055
dispcorr: -0.014139979 hartree
energy: -1324.389227634651
dipole: -25.30253 26.01496 0.71243 -4.89538 0.95363 -3.94175 -10.17537 7.40311 -2.77226
magnitude: 4.87138 au
magnitude: 12.38207 debye
