program: Orca
programVersion: 5.0.2
elementType: S F F F O N N N C C C C C C C C C C H H H H H H H H H H
charge: 0
multiplicity: 1
keywords: wb97x-d3
keywords: def2-TZVPP
keywords: def2/J RIJCOSX
keywords: DEFGRID2
keywords: scfconv7
keywords: smallprint printgap noloewdin
keywords: NOSOSCF
formula: C10H10F3N3OS
InChI: InChI=1/C10H10F3N3OS/c1-7(18(2,17)16-6-14)8-3-4-9(15-5-8)10(11,12)13/h3-5,7H,1-2H3
28 atoms
S  -2.535305 0.545635 0.579016
F  4.373204 -1.657664 -0.568497
F  4.685833 0.444763 -0.228542
F  4.151454 -0.845882 1.408848
O  -1.949295 1.835251 0.942128
N  -4.090624 0.476518 0.339115
N  1.710842 -1.433831 0.033485
N  -5.168209 2.048393 -1.234573
C  -1.66931 -0.084621 -0.904982
C  -0.197229 -0.152992 -0.616374
C  -2.309283 -1.366523 -1.409332
C  -2.306139 -0.642501 1.862093
C  0.609969 0.963249 -0.785384
C  0.413939 -1.33258 -0.192757
C  1.973156 0.864519 -0.554031
C  2.466516 -0.362593 -0.151651
C  3.929019 -0.599381 0.113614
C  -4.623165 1.326721 -0.507359
H  -1.853314 0.719971 -1.625748
H  -2.289796 -2.177335 -0.683224
H  -3.341477 -1.197574 -1.707106
H  -1.762876 -1.6971 -2.292439
H  -2.883162 -0.293366 2.718434
H  -2.662012 -1.621331 1.550094
H  -1.249922 -0.677207 2.121809
H  0.186661 1.901903 -1.118827
H  -0.164136 -2.235995 -0.03779
H  2.612437 1.724332 -0.694121
elementType: S F O N C H
totalener: -1324.37547845 hartree
nucrepener: 1498.94758364 hartree
electener: -2823.32306210 hartree
oneelecener: -4795.05734395 hartree
twoeener: 1971.73428186 hartree
cpcmener: -0.04590034 hartree
kineticenergy: 1319.96344212 hartree
xcener: -101.932243657928 hartree
chargesum: 0.0000000
charge: 0.778573 -0.173519 -0.176504 -0.175004 -0.519899 -0.448236 -0.350994 -0.237378 0.067221 -0.061634 -0.294017 -0.235963 -0.106632 0.008144 -0.108384 0.105462 0.502654 0.012278 0.148110 0.108254 0.118402 0.130573 0.160814 0.154359 0.151465 0.155483 0.135312 0.151058
qa: 0.7786 -0.1735 -0.1765 -0.1750 -0.5199 -0.4482 -0.3510 -0.2374 0.0672 -0.0616 -0.2940 -0.2360 -0.1066 0.0081 -0.1084 0.1055 0.5027 0.0123 0.1481 0.1083 0.1184 0.1306 0.1608 0.1544 0.1515 0.1555 0.1353 0.1511
va: 5.2217 1.1280 1.1271 1.1241 1.9562 2.7505 3.0917 3.0895 3.7444 3.6408 3.9680 3.8823 4.0314 4.0722 3.9565 3.8479 4.5176 4.3583 1.0082 0.9997 1.0071 0.9942 1.0107 1.0020 0.9999 1.0060 1.0020 1.0043
dispcorr: -0.014148823 hartree
energy: -1324.389627277479
dipole: -24.78458 25.98371 1.19913 -3.30384 1.17453 -2.12931 -2.08188 2.45737 0.37549
magnitude: 2.47242 au
magnitude: 6.28440 debye
