program: Orca
programVersion: 5.0.2
elementType: S F F F O N N N C C C C C C C C C C H H H H H H H H H H
charge: 0
multiplicity: 1
keywords: wb97x-d3
keywords: def2-TZVPP
keywords: def2/J RIJCOSX
keywords: DEFGRID2
keywords: scfconv7
keywords: smallprint printgap noloewdin
keywords: NOSOSCF
formula: C10H10F3N3OS
InChI: InChI=1/C10H10F3N3OS/c1-7(18(2,17)16-6-14)8-3-4-9(15-5-8)10(11,12)13/h3-5,7H,1-2H3
28 atoms
S  -2.823448 -0.387636 -0.471775
F  3.959354 0.017671 -1.500985
F  4.24427 1.188205 0.282841
F  4.459776 -0.952849 0.35087
O  -4.210935 -0.694107 -0.127385
N  -2.460192 1.082294 -0.894932
N  1.805824 -1.324389 -0.117409
N  -3.199523 3.033726 0.425837
C  -1.764497 -0.948205 0.91793
C  -0.336092 -0.590171 0.648022
C  -2.334446 -0.407047 2.221435
C  -2.291875 -1.313163 -1.878564
C  0.182678 0.67227 0.901209
C  0.530677 -1.552526 0.134297
C  1.521419 0.920929 0.642597
C  2.283117 -0.115846 0.136135
C  3.745136 0.041018 -0.18055
C  -2.873205 2.088513 -0.162534
H  -1.881746 -2.036337 0.894612
H  -1.707228 -0.766057 3.036917
H  -2.349149 0.680458 2.269027
H  -3.342939 -0.775576 2.394952
H  -2.416441 -2.372084 -1.660514
H  -2.936113 -1.024917 -2.708748
H  -1.256075 -1.084111 -2.116198
H  -0.431096 1.463979 1.310527
H  0.169058 -2.554786 -0.071712
H  1.939606 1.897762 0.839467
elementType: S F O N C H
totalener: -1324.37537397 hartree
nucrepener: 1516.34210790 hartree
electener: -2840.71748188 hartree
oneelecener: -4830.10602853 hartree
twoeener: 1989.38854666 hartree
cpcmener: -0.04460963 hartree
kineticenergy: 1319.97358744 hartree
xcener: -101.934456559376 hartree
chargesum: -0.0000000
charge: 0.751989 -0.175547 -0.176178 -0.172880 -0.517835 -0.422861 -0.349577 -0.233640 0.027841 -0.011675 -0.270043 -0.237001 -0.104584 -0.004547 -0.123591 0.106468 0.502205 0.014620 0.143727 0.124238 0.105397 0.119996 0.152789 0.157988 0.151955 0.149980 0.138730 0.152036
qa: 0.7520 -0.1755 -0.1762 -0.1729 -0.5178 -0.4229 -0.3496 -0.2336 0.0278 -0.0117 -0.2700 -0.2370 -0.1046 -0.0045 -0.1236 0.1065 0.5022 0.0146 0.1437 0.1242 0.1054 0.1200 0.1528 0.1580 0.1520 0.1500 0.1387 0.1520
va: 5.2340 1.1227 1.1273 1.1293 1.9601 2.7665 3.0768 3.0880 3.7955 3.5664 3.9465 3.8804 4.0160 4.0837 4.0161 3.8531 4.5163 4.3504 1.0122 0.9960 1.0085 1.0138 1.0020 1.0123 1.0006 1.0029 1.0033 1.0045
dispcorr: -0.014672738 hartree
energy: -1324.390046712944
dipole: -25.02833 25.39512 0.36678 -6.36655 3.34171 -3.02484 4.67089 -4.61059 0.06030
magnitude: 3.04759 au
magnitude: 7.74635 debye
