program: Orca
programVersion: 5.0.2
elementType: S F F F O N N N C C C C C C C C C C H H H H H H H H H H
charge: 0
multiplicity: 1
keywords: wb97x-d3
keywords: def2-TZVPP
keywords: def2/J RIJCOSX
keywords: DEFGRID2
keywords: scfconv7
keywords: smallprint printgap noloewdin
keywords: NOSOSCF
formula: C10H10F3N3OS
InChI: InChI=1/C10H10F3N3OS/c1-7(18(2,17)16-6-14)8-3-4-9(15-5-8)10(11,12)13/h3-5,7H,1-2H3
28 atoms
S  -2.498773 0.392498 0.645651
F  4.320733 -1.842478 -0.018852
F  4.686418 0.19755 -0.609553
F  4.166522 -0.256098 1.429302
O  -1.873389 1.402895 1.485555
N  -4.039181 0.397085 0.393428
N  1.978155 0.79886 0.074406
N  -5.038066 2.343831 -0.777835
C  -1.601653 0.396159 -0.962573
C  -0.159632 0.067253 -0.708556
C  -2.312361 -0.464054 -1.992485
C  -2.267354 -1.224988 1.335817
C  0.372449 -1.186736 -0.971061
C  0.70734 1.030503 -0.184144
C  1.708245 -1.438259 -0.699135
C  2.463711 -0.407055 -0.170475
C  3.925762 -0.576893 0.16188
C  -4.5474 1.455308 -0.221263
H  -1.691745 1.450622 -1.247683
H  -3.30877 -0.082297 -2.200113
H  -1.748984 -0.443605 -2.925012
H  -2.412204 -1.505295 -1.68734
H  -2.864596 -1.250786 2.245349
H  -2.616701 -1.989577 0.64799
H  -1.21597 -1.35762 1.576514
H  -0.237282 -1.974417 -1.394003
H  0.34938 2.030955 0.030063
H  2.134712 -2.409474 -0.90226
totalener: -1324.34410487 hartree
nucrepener: 1503.85067428 hartree
electener: -2828.19477915 hartree
oneelecener: -4805.33363526 hartree
twoeener: 1977.13885611 hartree
kineticenergy: 1320.01193603 hartree
xcener: -101.935811049222 hartree
chargesum: -0.0000000
charge: 0.746628 -0.175819 -0.157404 -0.154875 -0.445863 -0.402755 -0.276534 -0.108797 0.000006 -0.069530 -0.286314 -0.276716 -0.135479 0.013287 -0.101177 0.061811 0.509137 -0.046445 0.146280 0.130568 0.126210 0.077951 0.157206 0.132070 0.143914 0.132818 0.120574 0.139249
qa: 0.7466 -0.1758 -0.1574 -0.1549 -0.4459 -0.4028 -0.2765 -0.1088 0.0000 -0.0695 -0.2863 -0.2767 -0.1355 0.0133 -0.1012 0.0618 0.5091 -0.0464 0.1463 0.1306 0.1262 0.0780 0.1572 0.1321 0.1439 0.1328 0.1206 0.1392
va: 5.2851 1.1255 1.1513 1.1560 2.0351 2.7592 3.1166 3.0967 3.7851 3.6108 3.9761 3.9038 3.9584 4.1379 4.0009 3.9489 4.4992 4.3062 1.0087 1.0142 0.9953 1.0023 1.0160 1.0077 0.9982 1.0045 1.0198 1.0131
dispcorr: -0.014293641 hartree
energy: -1324.358398509942
dipole: -25.12535 25.77248 0.64714 -5.57795 2.75830 -2.81965 -6.15022 5.57225 -0.57796
magnitude: 2.95013 au
magnitude: 7.49863 debye
