program: Orca
programVersion: 5.0.2
elementType: S F F F O N N N C C C C C C C C C C H H H H H H H H H H
charge: 0
multiplicity: 1
keywords: wb97x-d3
keywords: def2-TZVPP
keywords: def2/J RIJCOSX
keywords: DEFGRID2
keywords: scfconv7
keywords: smallprint printgap noloewdin
keywords: NOSOSCF
formula: C10H10F3N3OS
InChI: InChI=1/C10H10F3N3OS/c1-7(18(2,17)16-6-14)8-3-4-9(15-5-8)10(11,12)13/h3-5,7H,1-2H3
28 atoms
S  -2.866257 -0.19606 -0.319653
F  4.549588 -0.896599 0.548864
F  4.160415 -0.149133 -1.431798
F  4.170894 1.197426 0.249981
O  -4.162649 -0.844817 -0.448781
N  -2.698151 1.098416 0.534689
N  1.872853 -1.334165 -0.58378
N  -3.752549 3.207674 -0.23629
C  -1.706912 -1.329958 0.488263
C  -0.280821 -0.887161 0.358328
C  -2.176643 -1.54265 1.923438
C  -2.217979 0.084916 -1.963715
C  0.235138 0.221009 1.019842
C  0.595896 -1.626011 -0.432048
C  1.574126 0.536607 0.862849
C  2.347766 -0.276109 0.048641
C  3.822731 -0.027141 -0.153643
C  -3.28343 2.206599 0.105922
H  -1.852149 -2.255428 -0.078522
H  -2.09783 -0.631378 2.511178
H  -3.209099 -1.886075 1.954046
H  -1.550766 -2.306153 2.382544
H  -2.894959 0.791494 -2.443776
H  -1.21883 0.50812 -1.909372
H  -2.220409 -0.853609 -2.513962
H  -0.400302 0.840718 1.636973
H  0.242242 -2.504307 -0.964611
H  1.992552 1.397488 1.363458
totalener: -1324.34663279 hartree
nucrepener: 1505.09366822 hartree
electener: -2829.44030101 hartree
oneelecener: -4807.81639883 hartree
twoeener: 1978.37609782 hartree
kineticenergy: 1320.02383996 hartree
xcener: -101.939381635506 hartree
chargesum: -0.0000000
charge: 0.693427 -0.160910 -0.153520 -0.171707 -0.441512 -0.408543 -0.280501 -0.104758 0.085830 -0.115605 -0.288225 -0.288194 -0.079426 -0.000038 -0.113071 0.066795 0.507944 -0.055770 0.122584 0.116036 0.123199 0.111684 0.161168 0.142664 0.138508 0.147067 0.104372 0.140501
qa: 0.6934 -0.1609 -0.1535 -0.1717 -0.4415 -0.4085 -0.2805 -0.1048 0.0858 -0.1156 -0.2882 -0.2882 -0.0794 -0.0000 -0.1131 0.0668 0.5079 -0.0558 0.1226 0.1160 0.1232 0.1117 0.1612 0.1427 0.1385 0.1471 0.1044 0.1405
va: 5.3271 1.1430 1.1587 1.1314 2.0415 2.7522 3.1167 3.1123 3.7494 3.6228 3.9687 3.9037 4.0069 4.1097 4.0132 3.9276 4.4997 4.3119 1.0185 1.0070 1.0134 0.9989 1.0104 0.9986 1.0100 1.0150 1.0099 1.0121
dispcorr: -0.014151744 hartree
energy: -1324.360784530841
dipole: -24.22861 24.89470 0.66609 -6.27120 4.37837 -1.89284 2.50992 -2.33854 0.17138
magnitude: 2.01392 au
magnitude: 5.11898 debye
