program: Orca
programVersion: 5.0.2
elementType: S F F F O N N N C C C C C C C C C C H H H H H H H H H H
charge: 0
multiplicity: 1
keywords: wb97x-d3
keywords: def2-TZVPP
keywords: def2/J RIJCOSX
keywords: DEFGRID2
keywords: scfconv7
keywords: smallprint printgap noloewdin
keywords: NOSOSCF
formula: C10H10F3N3OS
InChI: InChI=1/C10H10F3N3OS/c1-7(18(2,17)16-6-14)8-3-4-9(15-5-8)10(11,12)13/h3-5,7H,1-2H3
28 atoms
S  -2.844247 0.171463 -0.608994
F  4.324706 -0.501645 1.049771
F  4.441671 -0.174238 -1.075337
F  3.891713 1.442555 0.237932
O  -4.209003 -0.328677 -0.697861
N  -2.494883 1.436104 0.23217
N  1.529439 0.169665 0.891109
N  -3.027419 1.531141 2.65229
C  -1.7916 -1.260527 -0.136591
C  -0.340346 -0.893496 -0.146529
C  -2.309669 -1.830168 1.181115
C  -2.25248 0.661191 -2.207704
C  0.485096 -1.317083 -1.177842
C  0.248125 -0.140433 0.872928
C  1.831962 -0.992045 -1.167155
C  2.29985 -0.244862 -0.100524
C  3.75441 0.138255 0.02982
C  -2.807704 1.459053 1.517914
H  -1.990894 -1.982312 -0.935598
H  -1.741812 -2.730304 1.412999
H  -2.200601 -1.140387 2.014953
H  -3.359787 -2.103131 1.103087
H  -1.213418 0.970954 -2.150255
H  -2.382081 -0.171066 -2.895792
H  -2.874849 1.498325 -2.518249
H  0.083142 -1.9127 -1.989229
H  -0.334934 0.221905 1.712339
H  2.483878 -1.321639 -1.962607
totalener: -1324.34419821 hartree
nucrepener: 1517.30736791 hartree
electener: -2841.65156612 hartree
oneelecener: -4832.50736829 hartree
twoeener: 1990.85580217 hartree
kineticenergy: 1320.01143035 hartree
xcener: -101.936142323505 hartree
chargesum: 0.0000000
charge: 0.713755 -0.158423 -0.176443 -0.152794 -0.442870 -0.389546 -0.277407 -0.107278 -0.057272 -0.011405 -0.263159 -0.270028 -0.133207 0.017168 -0.095094 0.058417 0.508522 -0.036266 0.118629 0.109699 0.113216 0.128518 0.144149 0.130007 0.153650 0.125620 0.111577 0.138267
qa: 0.7138 -0.1584 -0.1764 -0.1528 -0.4429 -0.3895 -0.2774 -0.1073 -0.0573 -0.0114 -0.2632 -0.2700 -0.1332 0.0172 -0.0951 0.0584 0.5085 -0.0363 0.1186 0.1097 0.1132 0.1285 0.1441 0.1300 0.1537 0.1256 0.1116 0.1383
va: 5.3158 1.1485 1.1245 1.1595 2.0414 2.7732 3.1356 3.0864 3.8581 3.4619 3.9402 3.8912 3.9889 4.1171 3.9711 3.9471 4.4971 4.2822 1.0210 0.9964 1.0223 1.0140 1.0011 1.0079 1.0177 1.0084 1.0253 1.0124
dispcorr: -0.014681332 hartree
energy: -1324.358879542993
dipole: -24.46740 24.78156 0.31417 -8.76368 6.87179 -1.89190 -6.08709 3.15560 -2.93149
magnitude: 3.50308 au
magnitude: 8.90413 debye
