program: Orca
programVersion: 5.0.2
elementType: S F F F O N N N C C C C C C C C C C H H H H H H H H H H
charge: 0
multiplicity: 1
keywords: wb97x-d3
keywords: def2-TZVPP
keywords: def2/J RIJCOSX
keywords: DEFGRID2
keywords: scfconv7
keywords: smallprint printgap noloewdin
keywords: NOSOSCF
formula: C10H10F3N3OS
InChI: InChI=1/C10H10F3N3OS/c1-7(18(2,17)16-6-14)8-3-4-9(15-5-8)10(11,12)13/h3-5,7H,1-2H3
28 atoms
S  -2.511033 0.608395 0.602489
F  4.38175 -1.668643 -0.556566
F  4.656941 0.438032 -0.20243
F  4.100343 -0.86516 1.419136
O  -1.865565 1.872697 0.925745
N  -4.060459 0.518265 0.429245
N  1.70113 -1.477068 -0.103551
N  -5.089721 1.708759 -1.489889
C  -1.689791 -0.06129 -0.900235
C  -0.213593 -0.150456 -0.647253
C  -2.37179 -1.330926 -1.382927
C  -2.234357 -0.573405 1.895121
C  0.593322 0.979994 -0.709476
C  0.407927 -1.358278 -0.337068
C  1.95266 0.862964 -0.476938
C  2.453348 -0.393393 -0.175441
C  3.914892 -0.625737 0.120195
C  -4.587451 1.17666 -0.592716
H  -1.886158 0.74255 -1.619317
H  -2.359178 -2.133445 -0.646762
H  -3.40726 -1.1389 -1.652519
H  -1.859289 -1.692559 -2.273826
H  -2.763774 -0.192954 2.766869
H  -2.635007 -1.544643 1.620092
H  -1.168292 -0.62587 2.101112
H  0.166347 1.945886 -0.943835
H  -0.16123 -2.279759 -0.283311
H  2.593156 1.731111 -0.530162
totalener: -1324.34551685 hartree
nucrepener: 1503.53042481 hartree
electener: -2827.87594166 hartree
oneelecener: -4804.73178909 hartree
twoeener: 1976.85584743 hartree
kineticenergy: 1320.01476713 hartree
xcener: -101.936951193195 hartree
chargesum: 0.0000000
charge: 0.750033 -0.153934 -0.172832 -0.161626 -0.451251 -0.402296 -0.282718 -0.111473 0.012356 -0.066356 -0.291854 -0.278045 -0.074498 -0.034483 -0.108974 0.064165 0.508301 -0.047873 0.139852 0.080491 0.131517 0.128023 0.156049 0.134835 0.145878 0.136988 0.110520 0.139205
qa: 0.7500 -0.1539 -0.1728 -0.1616 -0.4513 -0.4023 -0.2827 -0.1115 0.0124 -0.0664 -0.2919 -0.2780 -0.0745 -0.0345 -0.1090 0.0642 0.5083 -0.0479 0.1399 0.0805 0.1315 0.1280 0.1560 0.1348 0.1459 0.1370 0.1105 0.1392
va: 5.2860 1.1575 1.1303 1.1426 2.0298 2.7587 3.1259 3.0941 3.7753 3.6050 3.9772 3.9027 4.0347 4.0958 3.9818 3.9251 4.5004 4.3085 1.0119 1.0022 1.0122 0.9951 1.0151 1.0079 0.9991 1.0163 1.0043 1.0116
dispcorr: -0.014271348 hartree
energy: -1324.359788196986
dipole: -24.81740 25.62527 0.80787 -2.84564 1.57504 -1.27060 -1.76375 2.27387 0.51012
magnitude: 1.58975 au
magnitude: 4.04082 debye
