program: Orca
programVersion: 5.0.2
elementType: S F F F O N N N C C C C C C C C C C H H H H H H H H H H
charge: 0
multiplicity: 1
keywords: wb97x-d3
keywords: def2-TZVPP
keywords: def2/J RIJCOSX
keywords: DEFGRID2
keywords: scfconv7
keywords: smallprint printgap noloewdin
keywords: NOSOSCF
formula: C10H10F3N3OS
InChI: InChI=1/C10H10F3N3OS/c1-7(18(2,17)16-6-14)8-3-4-9(15-5-8)10(11,12)13/h3-5,7H,1-2H3
28 atoms
S  -2.865266 -0.404497 -0.478702
F  3.947297 0.021641 -1.499493
F  4.220825 1.193182 0.287114
F  4.452938 -0.947617 0.354567
O  -4.215153 -0.833224 -0.141985
N  -2.560464 1.064349 -0.905998
N  1.805866 -1.343525 -0.050529
N  -2.949254 2.958428 0.644652
C  -1.780839 -0.938484 0.909799
C  -0.354407 -0.579537 0.641087
C  -2.355449 -0.398487 2.215719
C  -2.2651 -1.288548 -1.894698
C  0.153634 0.701764 0.820953
C  0.530814 -1.560517 0.200467
C  1.494409 0.938171 0.566811
C  2.274895 -0.121855 0.134069
C  3.741372 0.037488 -0.181354
C  -2.800406 2.050038 -0.058957
H  -1.890767 -2.028077 0.899161
H  -1.748824 -0.776638 3.037793
H  -2.350874 0.688154 2.265939
H  -3.377357 -0.739272 2.364548
H  -2.388943 -2.354265 -1.71735
H  -2.885428 -0.977009 -2.732928
H  -1.226481 -1.036374 -2.087705
H  -0.473584 1.515639 1.162266
H  0.184049 -2.579763 0.052479
H  1.90843 1.92587 0.70749
totalener: -1324.34682092 hartree
nucrepener: 1519.25148821 hartree
electener: -2843.59830912 hartree
oneelecener: -4836.34783049 hartree
twoeener: 1992.74952137 hartree
kineticenergy: 1320.02140400 hartree
xcener: -101.938746221480 hartree
chargesum: 0.0000000
charge: 0.715481 -0.162109 -0.171808 -0.154077 -0.442826 -0.384642 -0.282126 -0.117227 -0.061798 0.014085 -0.263791 -0.270092 -0.080486 -0.046113 -0.124651 0.066831 0.507769 -0.033242 0.123503 0.111234 0.112795 0.127172 0.132016 0.153113 0.146455 0.136702 0.105703 0.142126
qa: 0.7155 -0.1621 -0.1718 -0.1541 -0.4428 -0.3846 -0.2821 -0.1172 -0.0618 0.0141 -0.2638 -0.2701 -0.0805 -0.0461 -0.1247 0.0668 0.5078 -0.0332 0.1235 0.1112 0.1128 0.1272 0.1320 0.1531 0.1465 0.1367 0.1057 0.1421
va: 5.3050 1.1421 1.1316 1.1571 2.0418 2.7801 3.1118 3.0780 3.8654 3.4642 3.9351 3.8903 4.0212 4.1203 4.0446 3.9187 4.4998 4.2814 1.0172 0.9970 1.0216 1.0147 1.0078 1.0174 1.0020 1.0328 1.0073 1.0114
dispcorr: -0.014749898 hartree
energy: -1324.361570815054
dipole: -25.01205 25.10676 0.09472 -6.10565 4.12250 -1.98315 4.36970 -4.48774 -0.11804
magnitude: 1.98891 au
magnitude: 5.05542 debye
