program: Orca
programVersion: 5.0.2
elementType: Cl O O N N N N C C C C C C C C C C C H H H H H H H H H H H H H H H
charge: 0
multiplicity: 1
keywords: wb97x-d3
keywords: def2-TZVPP
keywords: def2/J RIJCOSX
keywords: DEFGRID2
keywords: scfconv7
keywords: smallprint printgap noloewdin
keywords: NOSOSCF
formula: C11H15ClN4O2
InChI: InChI=1/C11H15ClN4O2/c1-3-15(11(13-2)8-16(17)18)7-9-4-5-10(12)14-6-9/h4-6,8,13H,3,7H2,1-2H3
33 atoms
Cl 4.978504 -1.182424 0.104866
O  -1.925084 4.086985 0.944326
O  -3.027861 3.328283 -0.73345
N  -1.645665 -0.468157 0.321389
N  -2.776889 0.721182 -1.320566
N  2.654759 -2.351737 0.096886
N  -2.265991 3.138088 0.230046
C  -0.925667 -1.394444 -0.551653
C  -1.325586 -0.565648 1.745716
C  -2.082386 0.721289 -0.187866
C  0.567713 -1.279877 -0.395584
C  -1.491088 -1.973316 2.28642
C  1.240535 -0.077111 -0.597203
C  1.331577 -2.381253 -0.047498
C  -1.775635 1.900217 0.516194
C  2.612412 -0.026607 -0.445112
C  -3.459777 -0.403384 -1.919993
C  3.255531 -1.20505 -0.096495
H  -1.181301 -1.198823 -1.590074
H  -1.242425 -2.417699 -0.348615
H  -0.31054 -0.209525 1.951682
H  -2.008973 0.089252 2.283441
H  -1.339789 -1.947408 3.365296
H  -2.492883 -2.359738 2.099805
H  -0.767619 -2.678688 1.879191
H  -3.029822 1.640861 -1.655701
H  0.704192 0.821849 -0.876244
H  0.857838 -3.342375 0.117956
H  -1.07478 1.877834 1.331987
H  3.161286 0.891959 -0.593944
H  -3.607999 -1.204656 -1.200904
H  -2.923859 -0.800859 -2.782008
H  -4.436912 -0.067249 -2.2598
elementType: Cl O N C H
totalener: -1257.86015551 hartree
nucrepener: 1448.65480588 hartree
electener: -2706.51496139 hartree
oneelecener: -4595.82434515 hartree
twoeener: 1889.30938376 hartree
cpcmener: -0.05294580 hartree
kineticenergy: 1253.87521651 hartree
xcener: -97.125327085432 hartree
chargesum: 0.0000000
charge: -0.091266 -0.542950 -0.529443 -0.122442 -0.178215 -0.333656 0.510010 -0.025669 -0.074729 0.235595 -0.014942 -0.275115 -0.161681 0.010737 -0.221203 -0.152394 -0.159779 0.191561 0.153344 0.127581 0.106463 0.118631 0.100269 0.092187 0.089857 0.197247 0.168513 0.136618 0.136858 0.150038 0.121670 0.111399 0.124904
qa: -0.0913 -0.5430 -0.5294 -0.1224 -0.1782 -0.3337 0.5100 -0.0257 -0.0747 0.2356 -0.0149 -0.2751 -0.1617 0.0107 -0.2212 -0.1524 -0.1598 0.1916 0.1533 0.1276 0.1065 0.1186 0.1003 0.0922 0.0899 0.1972 0.1685 0.1366 0.1369 0.1500 0.1217 0.1114 0.1249
va: 1.2114 1.6671 1.7039 3.0998 3.2681 3.0515 4.0544 3.7809 3.8591 4.0520 3.5849 3.9431 3.9830 4.0534 3.8563 3.9572 3.8720 4.1293 0.9875 0.9913 0.9875 0.9911 1.0043 1.0062 1.0018 1.0342 0.9846 1.0084 1.0266 1.0042 1.0001 0.9855 0.9978
dispcorr: -0.016121334 hartree
energy: -1257.876276839779
dipole: -25.07700 23.96674 -1.11025 -8.52798 4.76825 -3.75974 1.32800 -2.41011 -1.08211
magnitude: 4.06685 au
magnitude: 10.33711 debye
