program: Orca
programVersion: 5.0.2
elementType: Cl O O N N N N C C C C C C C C C C C H H H H H H H H H H H H H H H
charge: 0
multiplicity: 1
keywords: wb97x-d3
keywords: def2-TZVPP
keywords: def2/J RIJCOSX
keywords: DEFGRID2
keywords: scfconv7
keywords: smallprint printgap noloewdin
keywords: NOSOSCF
formula: C11H15ClN4O2
InChI: InChI=1/C11H15ClN4O2/c1-3-15(11(13-2)8-16(17)18)7-9-4-5-10(12)14-6-9/h4-6,8,13H,3,7H2,1-2H3
33 atoms
Cl 4.679064 -1.753994 -0.719081
O  -2.465077 4.087599 1.227087
O  -2.315605 3.548961 -0.846068
N  -1.643269 -0.359006 0.456361
N  -2.071264 0.932941 -1.439091
N  2.481542 -2.276324 0.570595
N  -2.319045 3.221568 0.354905
C  -0.657313 -0.427852 1.529118
C  -2.021452 -1.635692 -0.147539
C  -1.947383 0.834741 -0.120113
C  0.7128 -0.711205 0.976106
C  -2.725951 -2.559163 0.831412
C  1.432225 0.270022 0.298463
C  1.29023 -1.965362 1.079531
C  -2.17753 1.92745 0.742781
C  2.67014 -0.033229 -0.233065
C  -1.392064 0.120326 -2.43008
C  3.130464 -1.330848 -0.061222
H  -0.945023 -1.20163 2.239182
H  -0.641187 0.506573 2.084422
H  -2.7021 -1.441346 -0.971584
H  -1.146414 -2.141191 -0.566209
H  -3.035009 -3.458064 0.297459
H  -2.089147 -2.880477 1.655133
H  -3.61989 -2.093729 1.24655
H  -2.39389 1.838643 -1.752818
H  1.031439 1.271079 0.189944
H  0.771966 -2.763133 1.599854
H  -2.27355 1.764906 1.802408
H  3.25467 0.707981 -0.758535
H  -1.024771 0.782986 -3.210233
H  -2.053909 -0.610776 -2.89262
H  -0.53718 -0.39753 -2.002509
elementType: Cl O N C H
totalener: -1257.85763271 hartree
nucrepener: 1454.62699045 hartree
electener: -2712.48462316 hartree
oneelecener: -4607.57550608 hartree
twoeener: 1895.09088292 hartree
cpcmener: -0.05536553 hartree
kineticenergy: 1253.87428053 hartree
xcener: -97.123647133389 hartree
chargesum: -0.0000000
charge: -0.090912 -0.550435 -0.538081 -0.076710 -0.172869 -0.331881 0.505896 -0.076717 -0.058390 0.226632 0.014447 -0.268843 -0.164879 0.006725 -0.246443 -0.148032 -0.137882 0.189160 0.134262 0.146010 0.113514 0.108798 0.097689 0.087930 0.088165 0.197158 0.167191 0.140019 0.136899 0.151761 0.126540 0.111620 0.111659
qa: -0.0909 -0.5504 -0.5381 -0.0767 -0.1729 -0.3319 0.5059 -0.0767 -0.0584 0.2266 0.0144 -0.2688 -0.1649 0.0067 -0.2464 -0.1480 -0.1379 0.1892 0.1343 0.1460 0.1135 0.1088 0.0977 0.0879 0.0882 0.1972 0.1672 0.1400 0.1369 0.1518 0.1265 0.1116 0.1117
va: 1.2118 1.6564 1.6933 3.1299 3.2600 3.0426 4.0648 3.8837 3.8547 4.0485 3.5140 3.9453 3.9805 4.0353 3.8986 3.9490 3.8747 4.1335 0.9932 0.9922 0.9930 0.9847 1.0042 1.0035 1.0075 1.0343 0.9852 1.0078 1.0271 1.0024 0.9977 0.9875 0.9876
dispcorr: -0.016555746 hartree
energy: -1257.874188458098
dipole: -22.78617 22.50362 -0.28255 -7.24544 3.65852 -3.58692 -0.39975 -0.37939 -0.77914
magnitude: 3.68142 au
magnitude: 9.35743 debye
