program: Orca
programVersion: 5.0.2
elementType: Cl O O N N N N C C C C C C C C C C C H H H H H H H H H H H H H H H
charge: 0
multiplicity: 1
keywords: wb97x-d3
keywords: def2-TZVPP
keywords: def2/J RIJCOSX
keywords: DEFGRID2
keywords: scfconv7
keywords: smallprint printgap noloewdin
keywords: NOSOSCF
formula: C11H15ClN4O2
InChI: InChI=1/C11H15ClN4O2/c1-3-15(11(13-2)8-16(17)18)7-9-4-5-10(12)14-6-9/h4-6,8,13H,3,7H2,1-2H3
33 atoms
Cl 4.519489 -0.193211 -1.202311
O  -0.261907 3.130785 1.813554
O  -1.525473 3.191415 0.079497
N  -1.922365 -0.933429 0.465333
N  -2.793724 0.927788 -0.616663
N  2.839082 -0.590668 0.744163
N  -0.997844 2.551169 1.006738
C  -0.775319 -1.533616 1.127674
C  -3.110899 -1.788555 0.401324
C  -1.992807 0.411617 0.313851
C  0.531191 -1.177281 0.479061
C  -3.019669 -2.905189 -0.619937
C  0.689836 -1.164704 -0.903184
C  1.642582 -0.878819 1.24983
C  -1.209002 1.217044 1.164202
C  1.923497 -0.858405 -1.445068
C  -3.236504 0.259106 -1.822006
C  2.954936 -0.581868 -0.560619
H  -0.907726 -2.614379 1.064821
H  -0.747801 -1.304829 2.197838
H  -3.250153 -2.218359 1.397611
H  -3.989205 -1.172812 0.225416
H  -2.159922 -3.551165 -0.439525
H  -3.911792 -3.527926 -0.550394
H  -2.950572 -2.529154 -1.639229
H  -2.786023 1.93813 -0.640435
H  -0.144099 -1.386255 -1.558164
H  1.568038 -0.86737 2.331544
H  -0.734955 0.797172 2.033455
H  2.077759 -0.838021 -2.514309
H  -3.401579 1.021072 -2.578707
H  -4.170892 -0.284088 -1.6904
H  -2.47696 -0.427766 -2.193101
elementType: Cl O N C H
totalener: -1257.85994452 hartree
nucrepener: 1477.11245068 hartree
electener: -2734.97239521 hartree
oneelecener: -4653.56488972 hartree
twoeener: 1918.59249451 hartree
cpcmener: -0.06102842 hartree
kineticenergy: 1253.88473970 hartree
xcener: -97.128133465000 hartree
chargesum: -0.0000000
charge: -0.092812 -0.546385 -0.533383 -0.088198 -0.192615 -0.334325 0.513054 -0.038393 -0.059931 0.271480 -0.032844 -0.260911 -0.095567 -0.004427 -0.262579 -0.185794 -0.145217 0.201036 0.132896 0.129899 0.112535 0.109156 0.091846 0.103309 0.088975 0.198368 0.155420 0.133272 0.139179 0.148505 0.126854 0.104095 0.113500
qa: -0.0928 -0.5464 -0.5334 -0.0882 -0.1926 -0.3343 0.5131 -0.0384 -0.0599 0.2715 -0.0328 -0.2609 -0.0956 -0.0044 -0.2626 -0.1858 -0.1452 0.2010 0.1329 0.1299 0.1125 0.1092 0.0918 0.1033 0.0890 0.1984 0.1554 0.1333 0.1392 0.1485 0.1269 0.1041 0.1135
va: 1.2096 1.6649 1.6958 3.1088 3.2546 3.0472 4.0585 3.8086 3.8427 4.0196 3.6269 3.9093 3.9236 4.0608 3.9047 4.0050 3.8795 4.1118 0.9879 1.0001 0.9982 0.9998 1.0029 1.0079 1.0021 1.0367 0.9991 1.0131 1.0306 1.0051 0.9991 0.9817 0.9911
dispcorr: -0.016747864 hartree
energy: -1257.876692388114
dipole: -32.16895 28.34616 -3.82279 -15.38670 10.37535 -5.01135 -2.53139 0.87064 -1.66075
magnitude: 6.51808 au
magnitude: 16.56765 debye
