program: Orca
programVersion: 5.0.2
elementType: Cl O O N N N N C C C C C C C C C C C H H H H H H H H H H H H H H H
charge: 0
multiplicity: 1
keywords: wb97x-d3
keywords: def2-TZVPP
keywords: def2/J RIJCOSX
keywords: DEFGRID2
keywords: scfconv7
keywords: smallprint printgap noloewdin
keywords: NOSOSCF
formula: C11H15ClN4O2
InChI: InChI=1/C11H15ClN4O2/c1-3-15(11(13-2)8-16(17)18)7-9-4-5-10(12)14-6-9/h4-6,8,13H,3,7H2,1-2H3
33 atoms
Cl 4.651869 -2.883352 0.919142
O  -5.236137 2.16785 -0.499108
O  -3.770325 3.10204 0.760386
N  -1.048813 0.259019 -0.625338
N  -1.248807 2.221228 0.603299
N  2.23851 -1.909586 0.919654
N  -4.075114 2.23676 -0.080434
C  0.260465 0.522116 -1.203087
C  -1.679643 -0.97284 -1.103684
C  -1.80562 1.297719 -0.174032
C  1.376556 -0.329258 -0.661238
C  -2.478486 -1.705466 -0.043705
C  2.611662 -0.320711 -1.305815
C  1.252263 -1.145776 0.450164
C  -3.156351 1.359422 -0.565932
C  3.645913 -1.099694 -0.827832
C  -0.025574 2.089351 1.363315
C  3.385833 -1.87484 0.292358
H  0.517977 1.574582 -1.095207
H  0.194058 0.357954 -2.284378
H  -2.284595 -0.787369 -1.996841
H  -0.868408 -1.621874 -1.432275
H  -2.857567 -2.636742 -0.464267
H  -1.855647 -1.955547 0.815345
H  -3.334711 -1.134399 0.312552
H  -1.876951 2.969812 0.864128
H  2.764079 0.29338 -2.18517
H  0.31909 -1.205763 0.995476
H  -3.538016 0.690859 -1.316849
H  4.612265 -1.109966 -1.310998
H  0.851599 2.445331 0.823446
H  0.142247 1.058507 1.668014
H  -0.127929 2.692369 2.261903
elementType: Cl O N C H
totalener: -1257.85908408 hartree
nucrepener: 1435.61202592 hartree
electener: -2693.47110999 hartree
oneelecener: -4569.67763421 hartree
twoeener: 1876.20652422 hartree
cpcmener: -0.05529441 hartree
kineticenergy: 1253.86910651 hartree
xcener: -97.126383279833 hartree
chargesum: -0.0000000
charge: -0.093352 -0.546135 -0.531207 -0.129440 -0.186335 -0.335014 0.510105 0.003471 -0.089903 0.281694 0.011953 -0.261760 -0.182432 0.006050 -0.263512 -0.156134 -0.153032 0.186003 0.132555 0.135764 0.113479 0.118765 0.100877 0.086888 0.103768 0.196988 0.151529 0.136104 0.140560 0.150398 0.106896 0.125407 0.129001
qa: -0.0934 -0.5461 -0.5312 -0.1294 -0.1863 -0.3350 0.5101 0.0035 -0.0899 0.2817 0.0120 -0.2618 -0.1824 0.0061 -0.2635 -0.1561 -0.1530 0.1860 0.1326 0.1358 0.1135 0.1188 0.1009 0.0869 0.1038 0.1970 0.1515 0.1361 0.1406 0.1504 0.1069 0.1254 0.1290
va: 1.2094 1.6643 1.6999 3.0977 3.2732 3.0661 4.0555 3.7656 3.8822 4.0163 3.5536 3.9336 4.0399 4.0109 3.8794 3.9457 3.8750 4.1255 0.9934 0.9940 1.0011 0.9867 1.0071 1.0021 0.9940 1.0388 1.0014 1.0158 1.0293 1.0030 0.9845 0.9897 0.9979
dispcorr: -0.016077332 hartree
energy: -1257.875161407441
dipole: -13.10891 16.91501 3.80609 5.64136 -6.34213 -0.70077 -5.22803 3.44971 -1.77832
magnitude: 4.25909 au
magnitude: 10.82574 debye
