program: Orca
programVersion: 5.0.2
elementType: Cl O O N N N N C C C C C C C C C C C H H H H H H H H H H H H H H H
charge: 0
multiplicity: 1
keywords: wb97x-d3
keywords: def2-TZVPP
keywords: def2/J RIJCOSX
keywords: DEFGRID2
keywords: scfconv7
keywords: smallprint printgap noloewdin
keywords: NOSOSCF
formula: C11H15ClN4O2
InChI: InChI=1/C11H15ClN4O2/c1-3-15(11(13-2)8-16(17)18)7-9-4-5-10(12)14-6-9/h4-6,8,13H,3,7H2,1-2H3
33 atoms
Cl 5.077342 -1.109011 0.15046
O  -1.006485 3.821894 -1.080753
O  -2.763204 3.441643 0.092278
N  -1.682578 -0.592004 0.037017
N  -3.175561 0.953556 0.93914
N  2.916505 -1.69118 -1.177865
N  -1.730313 3.027514 -0.468261
C  -0.751323 -0.942511 -1.016716
C  -1.82236 -1.609339 1.084537
C  -2.096834 0.686672 0.204896
C  0.704334 -0.948962 -0.619778
C  -2.561157 -2.86161 0.651089
C  1.215486 -0.278391 0.485008
C  1.609007 -1.647471 -1.407613
C  -1.357596 1.72226 -0.413865
C  2.574846 -0.318881 0.742969
C  -4.302428 0.078286 1.189233
C  3.367495 -1.039357 -0.132757
H  -0.903514 -0.282102 -1.870972
H  -1.017742 -1.936717 -1.379492
H  -0.816656 -1.888474 1.4105
H  -2.293159 -1.168151 1.957576
H  -2.632592 -3.541152 1.500118
H  -3.571725 -2.648886 0.305295
H  -2.037457 -3.394418 -0.14239
H  -3.361362 1.946219 1.012669
H  0.571606 0.27478 1.15743
H  1.260822 -2.200252 -2.273199
H  -0.408807 1.526853 -0.880498
H  2.996771 0.192856 1.595891
H  -4.396761 -0.682507 0.41881
H  -5.203866 0.685517 1.166187
H  -4.253357 -0.408118 2.162557
elementType: Cl O N C H
totalener: -1257.86050390 hartree
nucrepener: 1443.37647812 hartree
electener: -2701.23698201 hartree
oneelecener: -4585.38540332 hartree
twoeener: 1884.14842131 hartree
cpcmener: -0.05626574 hartree
kineticenergy: 1253.86759384 hartree
xcener: -97.129022177200 hartree
chargesum: 0.0000000
charge: -0.092484 -0.550977 -0.533431 -0.111588 -0.214135 -0.335955 0.502564 -0.009592 -0.048257 0.288765 -0.012203 -0.259692 -0.138067 -0.022829 -0.248233 -0.169423 -0.153106 0.194979 0.137012 0.134204 0.114158 0.119833 0.097894 0.087389 0.092257 0.197990 0.164048 0.136248 0.128638 0.149972 0.122121 0.125227 0.106673
qa: -0.0925 -0.5510 -0.5334 -0.1116 -0.2141 -0.3360 0.5026 -0.0096 -0.0483 0.2888 -0.0122 -0.2597 -0.1381 -0.0228 -0.2482 -0.1694 -0.1531 0.1950 0.1370 0.1342 0.1142 0.1198 0.0979 0.0874 0.0923 0.1980 0.1640 0.1362 0.1286 0.1500 0.1221 0.1252 0.1067
va: 1.2097 1.6564 1.6925 3.2004 3.2664 3.0436 4.0593 3.8221 3.8398 4.0422 3.5815 3.9298 3.9420 4.0996 3.8724 4.0171 3.8722 4.1215 0.9936 0.9872 0.9973 0.9920 1.0056 1.0035 1.0007 1.0440 0.9879 1.0076 1.0269 1.0044 0.9943 0.9977 0.9841
dispcorr: -0.015713778 hartree
energy: -1257.876217673468
dipole: -31.38962 28.92999 -2.45964 -11.13273 6.83523 -4.29750 5.75130 -3.99092 1.76037
magnitude: 5.25521 au
magnitude: 13.35768 debye
