program: Orca
programVersion: 5.0.2
elementType: Cl O O N N N N C C C C C C C C C C C H H H H H H H H H H H H H H H
charge: 0
multiplicity: 1
keywords: wb97x-d3
keywords: def2-TZVPP
keywords: def2/J RIJCOSX
keywords: DEFGRID2
keywords: scfconv7
keywords: smallprint printgap noloewdin
keywords: NOSOSCF
formula: C11H15ClN4O2
InChI: InChI=1/C11H15ClN4O2/c1-3-15(11(13-2)8-16(17)18)7-9-4-5-10(12)14-6-9/h4-6,8,13H,3,7H2,1-2H3
33 atoms
Cl 4.999112 -2.632835 0.236476
O  -3.24145 3.582428 -2.00228
O  -3.737348 3.343141 0.071193
N  -1.064517 0.132407 0.155456
N  -2.707301 1.238347 1.366277
N  2.77941 -2.205553 -1.051146
N  -3.119565 2.966944 -0.939149
C  -0.070841 0.238664 -0.909438
C  -1.438751 -1.243873 0.508492
C  -2.040707 1.090696 0.227156
C  1.204167 -0.468949 -0.552081
C  -2.293033 -1.919259 -0.550322
C  2.007072 -0.052723 0.506422
C  1.642574 -1.555122 -1.29075
C  -2.303646 1.874354 -0.909667
C  3.187683 -0.718138 0.772484
C  -2.302374 0.782267 2.676105
C  3.513309 -1.785366 -0.051524
H  0.155101 1.294002 -1.061905
H  -0.443192 -0.150785 -1.862733
H  -0.519215 -1.805022 0.671161
H  -1.960391 -1.258182 1.461165
H  -3.229017 -1.381989 -0.71015
H  -1.777807 -2.000487 -1.507652
H  -2.541845 -2.929668 -0.224955
H  -3.433537 1.941045 1.332073
H  1.721056 0.792679 1.119397
H  1.051895 -1.92104 -2.123058
H  -1.872739 1.622062 -1.862486
H  3.83415 -0.41459 1.58318
H  -2.517856 1.572239 3.39207
H  -1.236325 0.573389 2.710029
H  -2.846096 -0.109434 2.988653
elementType: Cl O N C H
totalener: -1257.85963348 hartree
nucrepener: 1425.51136264 hartree
electener: -2683.37099611 hartree
oneelecener: -4549.53967704 hartree
twoeener: 1866.16868093 hartree
cpcmener: -0.05189459 hartree
kineticenergy: 1253.87840621 hartree
xcener: -97.123257728802 hartree
chargesum: -0.0000000
charge: -0.090395 -0.538767 -0.523743 -0.113454 -0.177003 -0.335920 0.508017 -0.034580 -0.059683 0.232787 -0.044138 -0.264873 -0.158917 0.028750 -0.212485 -0.162068 -0.156913 0.190749 0.143159 0.132409 0.100637 0.124469 0.091094 0.090247 0.102227 0.199601 0.150777 0.131957 0.136660 0.150212 0.124607 0.119836 0.114743
qa: -0.0904 -0.5388 -0.5237 -0.1135 -0.1770 -0.3359 0.5080 -0.0346 -0.0597 0.2328 -0.0441 -0.2649 -0.1589 0.0287 -0.2125 -0.1621 -0.1569 0.1907 0.1432 0.1324 0.1006 0.1245 0.0911 0.0902 0.1022 0.1996 0.1508 0.1320 0.1367 0.1502 0.1246 0.1198 0.1147
va: 1.2124 1.6726 1.7097 3.1031 3.2705 3.0520 4.0574 3.7824 3.8643 4.0861 3.6559 3.9259 4.0044 4.0337 3.8587 3.9611 3.8738 4.1333 0.9932 0.9860 1.0001 0.9925 1.0022 1.0019 1.0072 1.0342 1.0070 1.0129 1.0298 1.0035 0.9974 0.9990 0.9842
dispcorr: -0.015622126 hartree
energy: -1257.875255603541
dipole: -21.74673 22.55968 0.81295 -0.17452 -2.13702 -2.31154 6.04085 -3.42909 2.61177
magnitude: 3.58126 au
magnitude: 9.10284 debye
