program: Orca
programVersion: 5.0.2
elementType: Cl O O N N N N C C C C C C C C C C C H H H H H H H H H H H H H H H
charge: 0
multiplicity: 1
keywords: wb97x-d3
keywords: def2-TZVPP
keywords: def2/J RIJCOSX
keywords: DEFGRID2
keywords: scfconv7
keywords: smallprint printgap noloewdin
keywords: NOSOSCF
formula: C11H15ClN4O2
InChI: InChI=1/C11H15ClN4O2/c1-3-15(11(13-2)8-16(17)18)7-9-4-5-10(12)14-6-9/h4-6,8,13H,3,7H2,1-2H3
33 atoms
Cl 4.556504 -0.433736 0.700795
O  -0.583297 3.451136 -1.227827
O  -1.471789 3.138975 0.701164
N  -1.951121 -0.854313 -0.384462
N  -2.544597 0.729584 1.205146
N  2.072409 -1.188182 0.877804
N  -1.138931 2.702538 -0.415457
C  -0.953384 -1.281869 -1.3524
C  -3.12403 -1.726048 -0.273864
C  -1.971402 0.433865 0.041407
C  0.452484 -1.038504 -0.880403
C  -2.861148 -3.038657 0.437591
C  1.420148 -0.499917 -1.718336
C  0.841025 -1.367415 0.410544
C  -1.376579 1.41361 -0.778342
C  2.70847 -0.311926 -1.250249
C  -2.750452 -0.185801 2.306852
C  2.961918 -0.676338 0.060897
H  -1.109742 -0.833023 -2.338571
H  -1.09352 -2.353672 -1.496615
H  -3.931955 -1.181797 0.209021
H  -3.473018 -1.927296 -1.291125
H  -2.074046 -3.616229 -0.048186
H  -2.580351 -2.895139 1.479767
H  -3.76667 -3.645269 0.41366
H  -2.529114 1.71518 1.429093
H  1.16913 -0.218429 -2.733527
H  0.128184 -1.791699 1.10864
H  -1.091268 1.18238 -1.789277
H  3.478763 0.1117 -1.878322
H  -1.982719 -0.957691 2.322423
H  -3.730123 -0.661898 2.287394
H  -2.675373 0.384038 3.229263
elementType: Cl O N C H
totalener: -1257.85956713 hartree
nucrepener: 1478.60073451 hartree
electener: -2736.46030164 hartree
oneelecener: -4656.68918049 hartree
twoeener: 1920.22887885 hartree
cpcmener: -0.05797643 hartree
kineticenergy: 1253.88215796 hartree
xcener: -97.127399829200 hartree
chargesum: 0.0000000
charge: -0.092479 -0.547274 -0.532607 -0.094654 -0.186260 -0.338210 0.513563 -0.044915 -0.056701 0.270360 -0.009281 -0.263629 -0.147819 0.018256 -0.266328 -0.150981 -0.147121 0.182727 0.128664 0.135021 0.107994 0.112996 0.092574 0.088651 0.104051 0.198098 0.151371 0.134114 0.141430 0.151307 0.113478 0.106644 0.126960
qa: -0.0925 -0.5473 -0.5326 -0.0947 -0.1863 -0.3382 0.5136 -0.0449 -0.0567 0.2704 -0.0093 -0.2636 -0.1478 0.0183 -0.2663 -0.1510 -0.1471 0.1827 0.1287 0.1350 0.1080 0.1130 0.0926 0.0887 0.1041 0.1981 0.1514 0.1341 0.1414 0.1513 0.1135 0.1066 0.1270
va: 1.2102 1.6639 1.6969 3.1009 3.2560 3.0607 4.0551 3.8098 3.8401 4.0140 3.5982 3.9105 3.9838 4.0223 3.9107 3.9561 3.8763 4.1327 1.0007 0.9875 0.9994 0.9983 1.0022 1.0020 1.0081 1.0368 1.0036 1.0172 1.0288 1.0023 0.9925 0.9824 0.9989
dispcorr: -0.016763573 hartree
energy: -1257.876330700218
dipole: -29.74381 26.84323 -2.90058 -14.65162 10.07794 -4.57368 -0.06112 -0.68534 -0.74647
magnitude: 5.46709 au
magnitude: 13.89624 debye
