program: Orca
programVersion: 5.0.2
elementType: Cl O O N N N N C C C C C C C C C C C H H H H H H H H H H H H H H H
charge: 0
multiplicity: 1
keywords: wb97x-d3
keywords: def2-TZVPP
keywords: def2/J RIJCOSX
keywords: DEFGRID2
keywords: scfconv7
keywords: smallprint printgap noloewdin
keywords: NOSOSCF
formula: C11H15ClN4O2
InChI: InChI=1/C11H15ClN4O2/c1-3-15(11(13-2)8-16(17)18)7-9-4-5-10(12)14-6-9/h4-6,8,13H,3,7H2,1-2H3
33 atoms
Cl 4.71602 -0.892087 -0.91843
O  -1.603881 3.574476 -1.554807
O  -2.478013 3.431085 0.399716
N  -1.799657 -0.6882 0.202906
N  -2.437968 1.035056 1.618296
N  2.464506 -2.13265 -0.526029
N  -1.930085 2.89483 -0.57699
C  -0.860146 -1.396567 1.07944
C  -1.844123 -1.172305 -1.176952
C  -1.978645 0.654836 0.433324
C  0.564518 -1.227301 0.624092
C  -2.289216 -2.619791 -1.271518
C  1.267375 -0.043805 0.836741
C  1.219852 -2.235007 -0.065931
C  -1.668943 1.556341 -0.596894
C  2.560275 0.081107 0.364355
C  -3.024416 0.191531 2.633429
C  3.095388 -1.005475 -0.31012
H  -1.125859 -2.452553 1.099602
H  -0.960851 -1.041032 2.102162
H  -2.563185 -0.559032 -1.717383
H  -0.878644 -1.051348 -1.681174
H  -2.403253 -2.880102 -2.323714
H  -1.571227 -3.319476 -0.845189
H  -3.251291 -2.774995 -0.783397
H  -2.509121 2.035204 1.747299
H  0.818642 0.778693 1.37974
H  0.72247 -3.180154 -0.252342
H  -1.157943 1.214662 -1.480078
H  3.130098 0.986098 0.518426
H  -3.867772 0.720112 3.071818
H  -2.320395 -0.03875 3.433761
H  -3.386776 -0.740275 2.207987
elementType: Cl O N C H
totalener: -1257.85929898 hartree
nucrepener: 1460.31572024 hartree
electener: -2718.17501922 hartree
oneelecener: -4619.41518847 hartree
twoeener: 1901.24016925 hartree
cpcmener: -0.05255510 hartree
kineticenergy: 1253.87392724 hartree
xcener: -97.121934815196 hartree
chargesum: -0.0000000
charge: -0.090379 -0.537941 -0.525806 -0.115020 -0.152786 -0.332283 0.511573 -0.049507 -0.092199 0.192725 -0.009981 -0.265526 -0.167631 0.005870 -0.193032 -0.149704 -0.161090 0.188454 0.133167 0.156907 0.119611 0.108639 0.099017 0.083918 0.089735 0.198861 0.166143 0.140678 0.135693 0.150992 0.125215 0.113623 0.122065
qa: -0.0904 -0.5379 -0.5258 -0.1150 -0.1528 -0.3323 0.5116 -0.0495 -0.0922 0.1927 -0.0100 -0.2655 -0.1676 0.0059 -0.1930 -0.1497 -0.1611 0.1885 0.1332 0.1569 0.1196 0.1086 0.0990 0.0839 0.0897 0.1989 0.1661 0.1407 0.1357 0.1510 0.1252 0.1136 0.1221
va: 1.2123 1.6739 1.7089 3.0697 3.2723 3.0464 4.0533 3.8069 3.8772 4.0757 3.5660 3.9387 3.9799 4.0389 3.8462 3.9467 3.8654 4.1342 0.9936 0.9894 0.9952 0.9860 1.0049 1.0044 1.0078 1.0308 0.9919 1.0079 1.0289 1.0030 0.9976 0.9865 1.0037
dispcorr: -0.016366953 hartree
energy: -1257.875665932815
dipole: -26.08660 24.71947 -1.36713 -10.08942 6.65941 -3.43001 7.47724 -4.72832 2.74891
magnitude: 4.60332 au
magnitude: 11.70070 debye
