program: Orca
programVersion: 5.0.2
elementType: Cl O O N N N N C C C C C C C C C C C H H H H H H H H H H H H H H H
charge: 0
multiplicity: 1
keywords: wb97x-d3
keywords: def2-TZVPP
keywords: def2/J RIJCOSX
keywords: DEFGRID2
keywords: scfconv7
keywords: smallprint printgap noloewdin
keywords: NOSOSCF
formula: C11H15ClN4O2
InChI: InChI=1/C11H15ClN4O2/c1-3-15(11(13-2)8-16(17)18)7-9-4-5-10(12)14-6-9/h4-6,8,13H,3,7H2,1-2H3
33 atoms
Cl 4.857538 -1.248206 -0.841778
O  -2.099189 3.705747 -1.601589
O  -2.861288 3.477654 0.391615
N  -1.679397 -0.520133 0.1813
N  -2.449247 1.124421 1.625412
N  2.624774 -2.345398 -0.077677
N  -2.292181 3.001732 -0.605083
C  -0.762353 -1.197364 1.098092
C  -1.677676 -1.017786 -1.194179
C  -2.005846 0.785075 0.420049
C  0.661515 -1.153039 0.609657
C  -1.9590 -2.506097 -1.276383
C  1.325909 0.051669 0.390846
C  1.365862 -2.317831 0.355201
C  -1.856462 1.711461 -0.627529
C  2.629934 0.042213 -0.063674
C  -2.97924 0.235187 2.634941
C  3.217896 -1.195602 -0.27728
H  -1.077185 -2.231884 1.236236
H  -0.809485 -0.732959 2.079865
H  -2.461601 -0.491712 -1.736196
H  -0.732345 -0.793282 -1.699943
H  -1.161377 -3.118789 -0.857809
H  -2.892153 -2.765695 -0.776634
H  -2.05628 -2.781035 -2.326509
H  -2.630357 2.111446 1.745307
H  0.83605 0.99975 0.576835
H  0.896089 -3.282791 0.509382
H  -1.332261 1.435697 -1.525774
H  3.170681 0.960678 -0.240559
H  -3.257714 -0.724392 2.207777
H  -3.872001 0.690824 3.057672
H  -2.272722 0.064619 3.447294
elementType: Cl O N C H
totalener: -1257.86003061 hartree
nucrepener: 1450.23422796 hartree
electener: -2708.09425857 hartree
oneelecener: -4599.00575343 hartree
twoeener: 1890.91149486 hartree
cpcmener: -0.05301521 hartree
kineticenergy: 1253.87596405 hartree
xcener: -97.124741172050 hartree
chargesum: -0.0000000
charge: -0.090967 -0.541792 -0.530251 -0.120389 -0.173276 -0.334242 0.510938 -0.027095 -0.074455 0.226077 -0.021081 -0.273109 -0.155924 0.012725 -0.217243 -0.153502 -0.159963 0.191414 0.127758 0.153127 0.118001 0.105134 0.089202 0.091245 0.100042 0.196446 0.169713 0.136563 0.136718 0.150320 0.121559 0.124706 0.111601
qa: -0.0910 -0.5418 -0.5303 -0.1204 -0.1733 -0.3342 0.5109 -0.0271 -0.0745 0.2261 -0.0211 -0.2731 -0.1559 0.0127 -0.2172 -0.1535 -0.1600 0.1914 0.1278 0.1531 0.1180 0.1051 0.0892 0.0912 0.1000 0.1964 0.1697 0.1366 0.1367 0.1503 0.1216 0.1247 0.1116
va: 1.2117 1.6683 1.7033 3.0966 3.2658 3.0505 4.0547 3.7828 3.8623 4.0559 3.5908 3.9434 3.9799 4.0518 3.8544 3.9569 3.8708 4.1303 0.9917 0.9882 0.9915 0.9875 1.0016 1.0068 1.0043 1.0333 0.9829 1.0082 1.0270 1.0042 1.0010 0.9978 0.9858
dispcorr: -0.016171034 hartree
energy: -1257.876201639697
dipole: -24.83336 23.99355 -0.83981 -8.15390 4.86224 -3.29166 6.59775 -4.22912 2.36863
magnitude: 4.14134 au
magnitude: 10.52646 debye
