program: Orca
programVersion: 5.0.2
elementType: Cl O O N N N N C C C C C C C C C C C H H H H H H H H H H H H H H H
charge: 0
multiplicity: 1
keywords: wb97x-d3
keywords: def2-TZVPP
keywords: def2/J RIJCOSX
keywords: DEFGRID2
keywords: scfconv7
keywords: smallprint printgap noloewdin
keywords: NOSOSCF
formula: C11H15ClN4O2
InChI: InChI=1/C11H15ClN4O2/c1-3-15(11(13-2)8-16(17)18)7-9-4-5-10(12)14-6-9/h4-6,8,13H,3,7H2,1-2H3
33 atoms
Cl 4.599886 -0.016557 0.309994
O  -1.478487 3.246272 1.866677
O  -1.610581 3.189722 -0.272459
N  -1.92327 -0.955803 0.02115
N  -1.639356 0.783711 -1.467448
N  2.281606 -0.944935 1.032272
N  -1.570519 2.608296 0.820384
C  -0.971606 -1.88012 -0.604506
C  -2.578632 -1.421397 1.240408
C  -1.738532 0.381565 -0.203084
C  0.45533 -1.429961 -0.440199
C  -3.543047 -2.560422 0.962528
C  1.22748 -1.01659 -1.518469
C  1.043781 -1.371194 0.817762
C  -1.612392 1.239704 0.894112
C  2.52235 -0.572101 -1.312176
C  -2.153387 0.086559 -2.622917
C  2.982505 -0.559347 -0.006588
H  -1.19039 -2.041853 -1.6609
H  -1.105006 -2.848938 -0.12463
H  -1.843656 -1.72193 1.994128
H  -3.144149 -0.592464 1.661271
H  -4.033346 -2.853108 1.891675
H  -4.314838 -2.253552 0.256527
H  -3.05084 -3.448867 0.565404
H  -1.416694 1.763042 -1.583029
H  0.823605 -1.041012 -2.523265
H  0.494554 -1.688775 1.697748
H  -1.511853 0.843031 1.889788
H  3.143538 -0.24687 -2.134468
H  -1.378252 -0.459511 -3.163135
H  -2.578832 0.820709 -3.304159
H  -2.939544 -0.610605 -2.340372
elementType: Cl O N C H
totalener: -1257.85822564 hartree
nucrepener: 1478.03248390 hartree
electener: -2735.89070954 hartree
oneelecener: -4655.37143412 hartree
twoeener: 1919.48072459 hartree
cpcmener: -0.04502969 hartree
kineticenergy: 1253.88143269 hartree
xcener: -97.121140104867 hartree
chargesum: -0.0000000
charge: -0.088107 -0.500799 -0.502863 -0.124988 -0.175872 -0.318998 0.500094 -0.039310 -0.042286 0.210103 0.040262 -0.271619 -0.161378 -0.038216 -0.221612 -0.152872 -0.152160 0.187424 0.130402 0.137993 0.100957 0.102677 0.096466 0.082594 0.086001 0.194315 0.155321 0.139268 0.136692 0.148918 0.097760 0.126227 0.117608
qa: -0.0881 -0.5008 -0.5029 -0.1250 -0.1759 -0.3190 0.5001 -0.0393 -0.0423 0.2101 0.0403 -0.2716 -0.1614 -0.0382 -0.2216 -0.1529 -0.1522 0.1874 0.1304 0.1380 0.1010 0.1027 0.0965 0.0826 0.0860 0.1943 0.1553 0.1393 0.1367 0.1489 0.0978 0.1262 0.1176
va: 1.2137 1.7235 1.7376 3.0716 3.2639 3.0466 4.0885 3.8210 3.8522 4.0540 3.5467 3.9328 4.0063 4.0603 3.8723 3.9720 3.8784 4.1327 0.9896 0.9955 0.9949 0.9993 1.0058 1.0088 1.0061 1.0359 0.9983 1.0102 1.0250 1.0032 0.9851 0.9993 0.9993
dispcorr: -0.016687034 hartree
energy: -1257.874912673019
dipole: -28.65457 26.98624 -1.66833 -15.12052 10.78404 -4.33648 -6.92310 4.08497 -2.83813
magnitude: 5.44457 au
magnitude: 13.83899 debye
