program: Orca
programVersion: 5.0.2
elementType: Cl O O N N N N C C C C C C C C C C C H H H H H H H H H H H H H H H
charge: 0
multiplicity: 1
keywords: wb97x-d3
keywords: def2-TZVPP
keywords: def2/J RIJCOSX
keywords: DEFGRID2
keywords: scfconv7
keywords: smallprint printgap noloewdin
keywords: NOSOSCF
formula: C11H15ClN4O2
InChI: InChI=1/C11H15ClN4O2/c1-3-15(11(13-2)8-16(17)18)7-9-4-5-10(12)14-6-9/h4-6,8,13H,3,7H2,1-2H3
33 atoms
Cl 4.829929 -0.086754 0.403734
O  -2.462137 3.507059 0.842747
O  -1.687371 2.963173 -1.081334
N  -1.832922 -1.001622 0.204479
N  -1.128611 0.374693 -1.521414
N  2.874517 -1.462504 -0.617376
N  -2.05996 2.647877 0.058616
C  -0.784407 -2.003685 0.027593
C  -2.855498 -1.255835 1.220379
C  -1.664739 0.248486 -0.308908
C  0.611217 -1.460339 0.167402
C  -4.263506 -0.958661 0.739984
C  0.970045 -0.567724 1.174865
C  1.611989 -1.870912 -0.699032
C  -2.025823 1.348497 0.48293
C  2.275984 -0.126066 1.265577
C  -1.175752 -0.607905 -2.579315
C  3.178584 -0.616031 0.332358
H  -0.877599 -2.539293 -0.919912
H  -0.938847 -2.753971 0.803528
H  -2.793032 -2.315392 1.461187
H  -2.64047 -0.725688 2.15345
H  -4.499056 -1.537751 -0.153583
H  -4.977071 -1.235913 1.516723
H  -4.419817 0.09565 0.514021
H  -0.960547 1.33301 -1.797198
H  0.238842 -0.212877 1.89093
H  1.389695 -2.569078 -1.499323
H  -2.320075 1.212427 1.508734
H  2.580724 0.570672 2.033508
H  -0.270428 -1.214356 -2.635154
H  -1.274299 -0.07751 -3.524013
H  -2.036588 -1.266125 -2.47247
elementType: Cl O N C H
totalener: -1257.85866892 hartree
nucrepener: 1475.00941755 hartree
electener: -2732.86808647 hartree
oneelecener: -4649.08327730 hartree
twoeener: 1916.21519083 hartree
cpcmener: -0.04405149 hartree
kineticenergy: 1253.87688764 hartree
xcener: -97.125118811069 hartree
chargesum: -0.0000000
charge: -0.088155 -0.508332 -0.506668 -0.093148 -0.171140 -0.325994 0.503836 0.000582 -0.041283 0.179098 -0.018217 -0.260271 -0.115381 -0.019544 -0.238364 -0.163389 -0.153456 0.194851 0.122536 0.120325 0.091995 0.092726 0.085239 0.096927 0.101701 0.194585 0.155078 0.133660 0.136776 0.148937 0.102376 0.124770 0.117344
qa: -0.0882 -0.5083 -0.5067 -0.0931 -0.1711 -0.3260 0.5038 0.0006 -0.0413 0.1791 -0.0182 -0.2603 -0.1154 -0.0195 -0.2384 -0.1634 -0.1535 0.1949 0.1225 0.1203 0.0920 0.0927 0.0852 0.0969 0.1017 0.1946 0.1551 0.1337 0.1368 0.1489 0.1024 0.1248 0.1173
va: 1.2137 1.7144 1.7317 3.0942 3.2434 3.0546 4.0850 3.7843 3.8693 4.0300 3.6056 3.9241 3.9604 4.0758 3.8675 3.9775 3.8796 4.1247 0.9897 0.9993 1.0005 0.9972 1.0059 1.0072 0.9964 1.0394 0.9972 1.0093 1.0300 1.0045 0.9821 1.0000 0.9940
dispcorr: -0.016790181 hartree
energy: -1257.875459104428
dipole: -28.94354 27.70964 -1.23389 -12.22123 7.82197 -4.39926 -1.84223 2.07236 0.23013
magnitude: 4.57481 au
magnitude: 11.62825 debye
