program: Orca
programVersion: 5.0.2
elementType: Cl O O N N N N C C C C C C C C C C C H H H H H H H H H H H H H H H
charge: 0
multiplicity: 1
keywords: wb97x-d3
keywords: def2-TZVPP
keywords: def2/J RIJCOSX
keywords: DEFGRID2
keywords: scfconv7
keywords: smallprint printgap noloewdin
keywords: NOSOSCF
formula: C11H15ClN4O2
InChI: InChI=1/C11H15ClN4O2/c1-3-15(11(13-2)8-16(17)18)7-9-4-5-10(12)14-6-9/h4-6,8,13H,3,7H2,1-2H3
33 atoms
Cl 4.701617 -2.415466 -0.962102
O  -2.522689 4.431433 1.06862
O  -3.235666 3.483148 -0.71693
N  -1.333115 -0.003613 0.57802
N  -2.80345 0.844044 -0.98732
N  3.047955 -1.784518 0.944781
N  -2.629556 3.430211 0.362526
C  -0.110548 0.227752 1.325255
C  -2.004791 -1.281713 0.839151
C  -2.079878 1.045158 0.109034
C  1.083202 -0.438762 0.691954
C  -1.290481 -2.518808 0.327878
C  1.367365 -0.292876 -0.662418
C  1.964049 -1.19783 1.445219
C  -2.069983 2.260807 0.806681
C  2.487633 -0.898354 -1.197913
C  -2.608979 -0.204229 -1.960668
C  3.286423 -1.631504 -0.332231
H  -0.221827 -0.112009 2.360004
H  0.094724 1.296365 1.369418
H  -2.141026 -1.369235 1.923005
H  -3.006769 -1.238164 0.417444
H  -1.93994 -3.382788 0.476772
H  -1.060006 -2.455442 -0.735364
H  -0.364583 -2.72059 0.864151
H  -3.405793 1.612937 -1.247917
H  0.717997 0.290199 -1.303841
H  1.787677 -1.348351 2.505247
H  -1.635688 2.324383 1.789548
H  2.731889 -0.803585 -2.24641
H  -1.589219 -0.5803 -1.928427
H  -2.785546 0.211614 -2.950523
H  -3.294166 -1.041077 -1.8202
elementType: Cl O N C H
totalener: -1257.85881599 hartree
nucrepener: 1439.46372622 hartree
electener: -2697.32254221 hartree
oneelecener: -4577.49927473 hartree
twoeener: 1880.17673252 hartree
cpcmener: -0.04286953 hartree
kineticenergy: 1253.87289562 hartree
xcener: -97.121550931208 hartree
chargesum: -0.0000000
charge: -0.090349 -0.505070 -0.505221 -0.123172 -0.172330 -0.325003 0.497997 -0.040624 -0.053274 0.258686 -0.019335 -0.266242 -0.155859 0.010317 -0.265761 -0.161553 -0.150949 0.193969 0.119882 0.135723 0.101819 0.107674 0.106838 0.088359 0.097848 0.193016 0.158759 0.132000 0.138770 0.147025 0.108816 0.127739 0.109505
qa: -0.0903 -0.5051 -0.5052 -0.1232 -0.1723 -0.3250 0.4980 -0.0406 -0.0533 0.2587 -0.0193 -0.2662 -0.1559 0.0103 -0.2658 -0.1616 -0.1509 0.1940 0.1199 0.1357 0.1018 0.1077 0.1068 0.0884 0.0978 0.1930 0.1588 0.1320 0.1388 0.1470 0.1088 0.1277 0.1095
va: 1.2114 1.7173 1.7340 3.0781 3.2530 3.0473 4.0898 3.8645 3.8297 4.0232 3.5953 3.9231 3.9803 4.0340 3.9029 3.9788 3.8800 4.1266 0.9985 0.9927 1.0055 0.9969 1.0083 1.0034 0.9955 1.0358 0.9918 1.0112 1.0237 1.0052 0.9953 0.9994 0.9836
dispcorr: -0.016575752 hartree
energy: -1257.875391744527
dipole: -21.84044 21.21087 -0.62957 -5.70742 2.41659 -3.29084 0.79362 -1.47141 -0.67779
magnitude: 3.41839 au
magnitude: 8.68885 debye
