program: Orca
programVersion: 5.0.2
elementType: Cl O O N N N N C C C C C C C C C C C H H H H H H H H H H H H H H H
charge: 0
multiplicity: 1
keywords: wb97x-d3
keywords: def2-TZVPP
keywords: def2/J RIJCOSX
keywords: DEFGRID2
keywords: scfconv7
keywords: smallprint printgap noloewdin
keywords: NOSOSCF
formula: C11H15ClN4O2
InChI: InChI=1/C11H15ClN4O2/c1-3-15(11(13-2)8-16(17)18)7-9-4-5-10(12)14-6-9/h4-6,8,13H,3,7H2,1-2H3
33 atoms
Cl 4.568253 -2.509762 -1.269367
O  -2.567798 4.468444 1.000643
O  -3.419476 3.374426 -0.634648
N  -1.224026 0.06224 0.646879
N  -2.886877 0.752582 -0.799867
N  2.370912 -1.1178 -1.27309
N  -2.696576 3.420181 0.371071
C  0.044658 0.405934 1.262114
C  -1.830201 -1.19481 1.105472
C  -2.062458 1.05111 0.197431
C  1.198297 -0.363979 0.673195
C  -1.155583 -2.469394 0.632993
C  2.162824 -0.9603 1.47484
C  1.360693 -0.473796 -0.701159
C  -2.030732 2.308594 0.815004
C  3.223899 -1.633202 0.894167
C  -2.775562 -0.373919 -1.69513
C  3.261607 -1.674726 -0.489259
H  0.01062 0.247432 2.345406
H  0.243888 1.465979 1.107076
H  -1.841431 -1.178081 2.201417
H  -2.874518 -1.205464 0.799273
H  -1.056464 -2.506803 -0.451857
H  -0.169055 -2.613005 1.070094
H  -1.768041 -3.318571 0.940544
H  -3.537996 1.485647 -1.046665
H  2.085571 -0.910952 2.554349
H  0.641137 -0.027163 -1.378323
H  -1.488236 2.453927 1.733184
H  3.984406 -2.110516 1.49562
H  -3.409183 -1.210964 -1.396588
H  -1.745938 -0.72066 -1.756531
H  -3.088297 -0.052672 -2.68705
elementType: Cl O N C H
totalener: -1257.85848822 hartree
nucrepener: 1438.66512377 hartree
electener: -2696.52361199 hartree
oneelecener: -4576.12478291 hartree
twoeener: 1879.60117092 hartree
cpcmener: -0.04256767 hartree
kineticenergy: 1253.87573769 hartree
xcener: -97.121560200379 hartree
chargesum: -0.0000000
charge: -0.090507 -0.505049 -0.504469 -0.130922 -0.170008 -0.323774 0.499007 -0.029514 -0.052830 0.261049 -0.029920 -0.267008 -0.138401 -0.008084 -0.264478 -0.149870 -0.151297 0.181274 0.120771 0.135437 0.101756 0.107434 0.090445 0.097173 0.107575 0.193701 0.146219 0.140305 0.139466 0.148477 0.108765 0.110052 0.127227
qa: -0.0905 -0.5050 -0.5045 -0.1309 -0.1700 -0.3238 0.4990 -0.0295 -0.0528 0.2610 -0.0299 -0.2670 -0.1384 -0.0081 -0.2645 -0.1499 -0.1513 0.1813 0.1208 0.1354 0.1018 0.1074 0.0904 0.0972 0.1076 0.1937 0.1462 0.1403 0.1395 0.1485 0.1088 0.1101 0.1272
va: 1.2110 1.7179 1.7349 3.0752 3.2598 3.0555 4.0865 3.8411 3.8262 4.0320 3.6022 3.9180 3.9754 4.0536 3.8992 3.9588 3.8815 4.1368 0.9976 0.9928 1.0064 0.9965 1.0036 0.9957 1.0079 1.0366 1.0045 1.0058 1.0236 1.0031 0.9835 0.9951 0.9992
dispcorr: -0.016496352 hartree
energy: -1257.874984567629
dipole: -19.70727 19.87025 0.16298 -6.31856 2.56005 -3.75851 6.80969 -5.37071 1.43898
magnitude: 4.02786 au
magnitude: 10.23800 debye
