program: Orca
programVersion: 5.0.2
elementType: Cl O O N N N N C C C C C C C C C C C H H H H H H H H H H H H H H H
charge: 0
multiplicity: 1
keywords: wb97x-d3
keywords: def2-TZVPP
keywords: def2/J RIJCOSX
keywords: DEFGRID2
keywords: scfconv7
keywords: smallprint printgap noloewdin
keywords: NOSOSCF
formula: C11H15ClN4O2
InChI: InChI=1/C11H15ClN4O2/c1-3-15(11(13-2)8-16(17)18)7-9-4-5-10(12)14-6-9/h4-6,8,13H,3,7H2,1-2H3
33 atoms
Cl 5.067393 -1.355553 0.321154
O  -1.459255 3.859459 -1.30755
O  -3.15697 3.288225 -0.129148
N  -1.60818 -0.592039 -0.134485
N  -3.28518 0.773706 0.723371
N  2.890305 -2.057174 -0.916878
N  -2.08426 2.99891 -0.685846
C  -0.665528 -0.88457 -1.199626
C  -1.71815 -1.637326 0.889885
C  -2.17395 0.630538 -0.000982
C  0.773966 -0.941652 -0.754549
C  -1.311279 -1.19734 2.284118
C  1.336568 -0.027188 0.132432
C  1.606011 -1.941128 -1.237796
C  -1.557579 1.74129 -0.618087
C  2.67029 -0.136411 0.478692
C  -4.313787 -0.214777 0.963824
C  3.390064 -1.177052 -0.087371
H  -0.789507 -0.16572 -2.009193
H  -0.939316 -1.851877 -1.627401
H  -2.714461 -2.077454 0.900853
H  -1.053866 -2.439305 0.569966
H  -1.930616 -0.390466 2.674941
H  -1.410398 -2.043925 2.964322
H  -0.272014 -0.869285 2.309618
H  -3.577184 1.739578 0.804905
H  0.747297 0.771298 0.565196
H  1.21739 -2.692883 -1.916985
H  -0.594395 1.657236 -1.088299
H  3.13006 0.561056 1.164216
H  -4.422818 -0.899952 0.124339
H  -5.254616 0.318064 1.08052
H  -4.147037 -0.790235 1.875331
elementType: Cl O N C H
totalener: -1257.86061057 hartree
nucrepener: 1448.51060890 hartree
electener: -2706.37121947 hartree
oneelecener: -4595.71100563 hartree
twoeener: 1889.33978616 hartree
cpcmener: -0.04379849 hartree
kineticenergy: 1253.86919946 hartree
xcener: -97.126938816235 hartree
chargesum: -0.0000000
charge: -0.088200 -0.516230 -0.510665 -0.098276 -0.216824 -0.325926 0.492083 -0.008695 -0.057164 0.308954 0.002754 -0.270819 -0.171082 -0.009402 -0.291418 -0.166581 -0.154683 0.198508 0.127261 0.127753 0.114392 0.104366 0.095437 0.105139 0.097442 0.193796 0.171221 0.129302 0.125809 0.147977 0.120014 0.122125 0.101632
qa: -0.0882 -0.5162 -0.5107 -0.0983 -0.2168 -0.3259 0.4921 -0.0087 -0.0572 0.3090 0.0028 -0.2708 -0.1711 -0.0094 -0.2914 -0.1666 -0.1547 0.1985 0.1273 0.1278 0.1144 0.1044 0.0954 0.1051 0.0974 0.1938 0.1712 0.1293 0.1258 0.1480 0.1200 0.1221 0.1016
va: 1.2137 1.7025 1.7240 3.1703 3.2513 3.0491 4.0913 3.8174 3.8645 3.9976 3.5657 3.9178 3.9567 4.0895 3.8825 4.0154 3.8849 4.1259 0.9963 0.9893 0.9881 0.9985 1.0044 1.0075 1.0006 1.0484 0.9830 1.0118 1.0273 1.0059 0.9885 0.9993 0.9805
dispcorr: -0.016310711 hartree
energy: -1257.876921281045
dipole: -27.67412 25.98092 -1.69320 -6.83093 3.12578 -3.70516 7.75203 -6.36127 1.39075
magnitude: 4.30457 au
magnitude: 10.94134 debye
