program: Orca
programVersion: 5.0.2
elementType: Cl O O N N N N C C C C C C C C C C C H H H H H H H H H H H H H H H
charge: 0
multiplicity: 1
keywords: wb97x-d3
keywords: def2-TZVPP
keywords: def2/J RIJCOSX
keywords: DEFGRID2
keywords: scfconv7
keywords: smallprint printgap noloewdin
keywords: NOSOSCF
formula: C11H15ClN4O2
InChI: InChI=1/C11H15ClN4O2/c1-3-15(11(13-2)8-16(17)18)7-9-4-5-10(12)14-6-9/h4-6,8,13H,3,7H2,1-2H3
33 atoms
Cl 4.959142 -2.543344 0.480046
O  -3.328721 3.599951 -1.929979
O  -3.661389 3.381887 0.175725
N  -1.102102 0.089278 0.070788
N  -2.584229 1.2594 1.407127
N  2.832921 -2.157503 -0.964012
N  -3.143122 2.990329 -0.879351
C  -0.109582 0.185726 -0.990822
C  -1.504336 -1.276261 0.423451
C  -2.031927 1.088284 0.210082
C  1.176003 -0.472916 -0.577008
C  -2.349838 -1.949412 -0.64502
C  1.892608 -0.034005 0.533946
C  1.697533 -1.542584 -1.285231
C  -2.358568 1.865555 -0.90708
C  3.072798 -0.661572 0.880714
C  -2.064565 0.792978 2.670421
C  3.483495 -1.7212 0.08303
H  0.086927 1.240426 -1.185054
H  -0.458194 -0.249918 -1.933293
H  -0.598483 -1.854392 0.60902
H  -2.048378 -1.270859 1.364668
H  -3.270628 -1.396963 -0.836784
H  -1.816521 -2.059733 -1.589663
H  -2.628266 -2.949762 -0.311217
H  -3.307055 1.965997 1.43947
H  1.533553 0.798294 1.127107
H  1.175863 -1.928872 -2.154451
H  -2.01531 1.588395 -1.889205
H  3.651558 -0.339562 1.734764
H  -2.144711 1.600384 3.396249
H  -1.016664 0.515754 2.583127
H  -2.621603 -0.061998 3.056632
elementType: Cl O N C H
totalener: -1257.86158939 hartree
nucrepener: 1427.80345357 hartree
electener: -2685.66504296 hartree
oneelecener: -4554.24516337 hartree
twoeener: 1868.58012041 hartree
cpcmener: -0.04091624 hartree
kineticenergy: 1253.87786632 hartree
xcener: -97.120890953758 hartree
chargesum: 0.0000000
charge: -0.087982 -0.501279 -0.501005 -0.118291 -0.182794 -0.326885 0.499906 -0.040409 -0.056007 0.233271 -0.036757 -0.265888 -0.159712 0.024507 -0.226966 -0.163395 -0.160324 0.191202 0.139347 0.127654 0.099127 0.118762 0.091209 0.088925 0.100942 0.195376 0.149242 0.129324 0.136009 0.149434 0.124688 0.116936 0.111832
qa: -0.0880 -0.5013 -0.5010 -0.1183 -0.1828 -0.3269 0.4999 -0.0404 -0.0560 0.2333 -0.0368 -0.2659 -0.1597 0.0245 -0.2270 -0.1634 -0.1603 0.1912 0.1393 0.1277 0.0991 0.1188 0.0912 0.0889 0.1009 0.1954 0.1492 0.1293 0.1360 0.1494 0.1247 0.1169 0.1118
va: 1.2139 1.7225 1.7385 3.0680 3.2591 3.0543 4.0875 3.8056 3.8599 4.0582 3.6452 3.9310 4.0037 4.0414 3.8638 3.9691 3.8787 4.1343 0.9959 0.9869 0.9982 0.9925 1.0022 1.0020 1.0071 1.0366 1.0058 1.0126 1.0279 1.0039 0.9981 0.9980 0.9851
dispcorr: -0.015778865 hartree
energy: -1257.877368252620
dipole: -21.45623 22.11696 0.66074 -0.73884 -1.39128 -2.13012 4.68544 -2.44421 2.24122
magnitude: 3.16181 au
magnitude: 8.03669 debye
