program: Orca
programVersion: 5.0.2
elementType: Cl O O N N N N C C C C C C C C C C C H H H H H H H H H H H H H H H
charge: 0
multiplicity: 1
keywords: wb97x-d3
keywords: def2-TZVPP
keywords: def2/J RIJCOSX
keywords: DEFGRID2
keywords: scfconv7
keywords: smallprint printgap noloewdin
keywords: NOSOSCF
formula: C11H15ClN4O2
InChI: InChI=1/C11H15ClN4O2/c1-3-15(11(13-2)8-16(17)18)7-9-4-5-10(12)14-6-9/h4-6,8,13H,3,7H2,1-2H3
33 atoms
Cl 4.773874 -0.955054 -0.898988
O  -1.712452 3.613048 -1.55811
O  -2.543457 3.442911 0.410875
N  -1.752081 -0.651507 0.193862
N  -2.422647 1.041619 1.623282
N  2.524961 -2.173283 -0.438597
N  -2.000225 2.930863 -0.576953
C  -0.819527 -1.34945 1.081483
C  -1.814489 -1.156685 -1.175323
C  -1.969971 0.685205 0.424515
C  0.606853 -1.205165 0.621579
C  -2.282432 -2.599031 -1.236438
C  1.300036 -0.004091 0.756215
C  1.276758 -2.254974 0.012398
C  -1.694539 1.593871 -0.602107
C  2.596598 0.097882 0.289242
C  -3.047433 0.17849 2.597839
C  3.147533 -1.031079 -0.299445
H  -1.094146 -2.403088 1.130052
H  -0.913495 -0.96571 2.095178
H  -2.528922 -0.54258 -1.721383
H  -0.851429 -1.057632 -1.689393
H  -3.234427 -2.727801 -0.720326
H  -2.427555 -2.878826 -2.28031
H  -1.56534 -3.302857 -0.814488
H  -2.508748 2.038411 1.767134
H  0.839619 0.850971 1.23591
H  0.787705 -3.21498 -0.114711
H  -1.180468 1.271657 -1.491292
H  3.157209 1.016992 0.382912
H  -2.381015 -0.059662 3.428358
H  -3.37831 -0.750603 2.139863
H  -3.919102 0.688535 3.004191
elementType: Cl O N C H
totalener: -1257.86103065 hartree
nucrepener: 1456.83635961 hartree
electener: -2714.69739025 hartree
oneelecener: -4612.55107450 hartree
twoeener: 1897.85368424 hartree
cpcmener: -0.04105064 hartree
kineticenergy: 1253.87364323 hartree
xcener: -97.120286738914 hartree
chargesum: 0.0000000
charge: -0.086907 -0.500188 -0.502481 -0.112874 -0.169165 -0.324412 0.502491 -0.054706 -0.087049 0.192150 -0.014184 -0.264393 -0.158437 0.006983 -0.208312 -0.154345 -0.161640 0.190414 0.131522 0.152633 0.116365 0.106789 0.088696 0.099542 0.082848 0.193996 0.164151 0.134378 0.133958 0.149269 0.109655 0.119423 0.123829
qa: -0.0869 -0.5002 -0.5025 -0.1129 -0.1692 -0.3244 0.5025 -0.0547 -0.0870 0.1922 -0.0142 -0.2644 -0.1584 0.0070 -0.2083 -0.1543 -0.1616 0.1904 0.1315 0.1526 0.1164 0.1068 0.0887 0.0995 0.0828 0.1940 0.1642 0.1344 0.1340 0.1493 0.1097 0.1194 0.1238
va: 1.2151 1.7233 1.7385 3.0571 3.2463 3.0530 4.0854 3.8128 3.8742 4.0538 3.5676 3.9387 3.9784 4.0488 3.8463 3.9574 3.8691 4.1346 0.9923 0.9904 0.9959 0.9864 1.0080 1.0056 1.0036 1.0353 0.9901 1.0091 1.0289 1.0042 0.9864 1.0046 0.9983
dispcorr: -0.016317854 hartree
energy: -1257.877348501184
dipole: -26.20031 24.95590 -1.24441 -9.82268 6.73314 -3.08955 7.29140 -4.85089 2.44050
magnitude: 4.12915 au
magnitude: 10.49548 debye
