program: Orca
programVersion: 5.0.2
elementType: Cl O O N N N N C C C C C C C C C C C H H H H H H H H H H H H H H H
charge: 0
multiplicity: 1
keywords: wb97x-d3
keywords: def2-TZVPP
keywords: def2/J RIJCOSX
keywords: DEFGRID2
keywords: scfconv7
keywords: smallprint printgap noloewdin
keywords: NOSOSCF
formula: C11H15ClN4O2
InChI: InChI=1/C11H15ClN4O2/c1-3-15(11(13-2)8-16(17)18)7-9-4-5-10(12)14-6-9/h4-6,8,13H,3,7H2,1-2H3
33 atoms
Cl 4.901678 -0.964263 0.197304
O  -1.600619 3.939694 1.072067
O  -2.740506 3.347913 -0.645001
N  -1.719204 -0.596458 0.260612
N  -2.721109 0.753016 -1.332696
N  2.612635 -2.194898 0.294802
N  -2.014707 3.0619 0.317548
C  -0.965059 -1.475822 -0.634161
C  -1.492797 -0.805906 1.688287
C  -2.044903 0.656936 -0.19119
C  0.522035 -1.306391 -0.467639
C  -1.852987 -2.212488 2.128812
C  1.171597 -0.134823 -0.85254
C  1.301095 -2.30191 0.100506
C  -1.643238 1.765902 0.562627
C  2.532885 -0.00745 -0.655585
C  -3.475974 -0.296272 -1.976344
C  3.190918 -1.080552 -0.072077
H  -1.234482 -1.270273 -1.667749
H  -1.249019 -2.511545 -0.4472
H  -0.457432 -0.58347 1.970982
H  -2.126678 -0.105398 2.229647
H  -2.875261 -2.46651 1.845847
H  -1.185696 -2.973992 1.72589
H  -1.783289 -2.269924 3.215284
H  -2.878782 1.699828 -1.650462
H  0.625554 0.677339 -1.316636
H  0.849107 -3.23667 0.415183
H  -0.965658 1.647066 1.390463
H  3.061687 0.888633 -0.94766
H  -3.687169 -1.106761 -1.282154
H  -2.959484 -0.705698 -2.84612
H  -4.42341 0.118959 -2.315812
elementType: Cl O N C H
totalener: -1257.86133844 hartree
nucrepener: 1454.24847099 hartree
electener: -2712.10980943 hartree
oneelecener: -4607.29409771 hartree
twoeener: 1895.18428828 hartree
cpcmener: -0.04113777 hartree
kineticenergy: 1253.87395656 hartree
xcener: -97.121160597438 hartree
chargesum: -0.0000000
charge: -0.087747 -0.502103 -0.503488 -0.115115 -0.175791 -0.324466 0.501758 -0.048346 -0.081957 0.201717 -0.021149 -0.266395 -0.154859 0.010809 -0.213628 -0.155333 -0.161160 0.190945 0.152912 0.129299 0.105190 0.116485 0.089134 0.083983 0.099972 0.194148 0.167221 0.134602 0.132669 0.148925 0.119486 0.108200 0.124079
qa: -0.0877 -0.5021 -0.5035 -0.1151 -0.1758 -0.3245 0.5018 -0.0483 -0.0820 0.2017 -0.0211 -0.2664 -0.1549 0.0108 -0.2136 -0.1553 -0.1612 0.1909 0.1529 0.1293 0.1052 0.1165 0.0891 0.0840 0.1000 0.1941 0.1672 0.1346 0.1327 0.1489 0.1195 0.1082 0.1241
va: 1.2142 1.7208 1.7374 3.0653 3.2456 3.0547 4.0852 3.8049 3.8713 4.0500 3.5771 3.9404 3.9797 4.0526 3.8490 3.9602 3.8711 4.1342 0.9896 0.9917 0.9865 0.9941 1.0076 1.0030 1.0055 1.0367 0.9854 1.0085 1.0293 1.0047 1.0036 0.9862 0.9983
dispcorr: -0.016272399 hartree
energy: -1257.877610842615
dipole: -26.44641 24.98154 -1.46487 -9.94147 6.49049 -3.45098 -0.11589 -1.28119 -1.39708
magnitude: 4.00087 au
magnitude: 10.16940 debye
