program: Orca
programVersion: 5.0.2
elementType: Cl O O N N N N C C C C C C C C C C C H H H H H H H H H H H H H H H
charge: 0
multiplicity: 1
keywords: wb97x-d3
keywords: def2-TZVPP
keywords: def2/J RIJCOSX
keywords: DEFGRID2
keywords: scfconv7
keywords: smallprint printgap noloewdin
keywords: NOSOSCF
formula: C11H15ClN4O2
InChI: InChI=1/C11H15ClN4O2/c1-3-15(11(13-2)8-16(17)18)7-9-4-5-10(12)14-6-9/h4-6,8,13H,3,7H2,1-2H3
33 atoms
Cl 4.950487 -1.079441 0.162492
O  -1.756125 4.018734 0.99657
O  -2.866462 3.343808 -0.709051
N  -1.675227 -0.532053 0.286058
N  -2.757815 0.730686 -1.325984
N  2.643424 -2.278789 0.188674
N  -2.130697 3.108698 0.259489
C  -0.937356 -1.427835 -0.603668
C  -1.408205 -0.696106 1.712792
C  -2.061868 0.691989 -0.192354
C  0.55342 -1.289323 -0.438091
C  -1.69243 -2.106543 2.195131
C  1.214925 -0.095934 -0.721779
C  1.326327 -2.346309 0.015051
C  -1.701584 1.835989 0.530279
C  2.581583 -0.008468 -0.542572
C  -3.495841 -0.360207 -1.918832
C  3.233517 -1.143401 -0.08134
H  -1.198841 -1.215602 -1.638044
H  -1.23877 -2.459469 -0.41934
H  -0.377782 -0.419845 1.963918
H  -2.060939 -0.011907 2.252542
H  -1.592611 -2.133307 3.280367
H  -2.708629 -2.414574 1.946117
H  -1.000482 -2.846499 1.793608
H  -2.958939 1.66172 -1.664441
H  0.673433 0.76724 -1.089531
H  0.864938 -3.300559 0.246882
H  -1.011506 1.766535 1.353243
H  3.119351 0.904306 -0.756134
H  -4.465089 0.015204 -2.243274
H  -3.663882 -1.1565 -1.196806
H  -2.989917 -0.778901 -2.790383
elementType: Cl O N C H
totalener: -1257.86155382 hartree
nucrepener: 1450.92162245 hartree
electener: -2708.78317627 hartree
oneelecener: -4600.57972715 hartree
twoeener: 1891.79655088 hartree
cpcmener: -0.04107418 hartree
kineticenergy: 1253.87356612 hartree
xcener: -97.121870180118 hartree
chargesum: 0.0000000
charge: -0.087658 -0.502927 -0.503707 -0.119544 -0.181789 -0.324864 0.502436 -0.041262 -0.077233 0.216914 -0.023340 -0.269541 -0.152417 0.012966 -0.225509 -0.157714 -0.160509 0.192349 0.150790 0.127537 0.103839 0.116752 0.100132 0.089631 0.086037 0.193375 0.169368 0.133379 0.132891 0.148700 0.124203 0.119096 0.107620
qa: -0.0877 -0.5029 -0.5037 -0.1195 -0.1818 -0.3249 0.5024 -0.0413 -0.0772 0.2169 -0.0233 -0.2695 -0.1524 0.0130 -0.2255 -0.1577 -0.1605 0.1923 0.1508 0.1275 0.1038 0.1168 0.1001 0.0896 0.0860 0.1934 0.1694 0.1334 0.1329 0.1487 0.1242 0.1191 0.1076
va: 1.2144 1.7197 1.7372 3.0704 3.2473 3.0563 4.0848 3.7941 3.8664 4.0418 3.5808 3.9422 3.9785 4.0558 3.8523 3.9638 3.8724 4.1320 0.9894 0.9911 0.9869 0.9927 1.0053 1.0073 1.0023 1.0374 0.9820 1.0083 1.0287 1.0050 0.9983 1.0026 0.9858
dispcorr: -0.016212729 hartree
energy: -1257.877766547730
dipole: -25.93736 24.63433 -1.30303 -9.28290 5.86244 -3.42046 0.63587 -1.81083 -1.17496
magnitude: 3.84421 au
magnitude: 9.77121 debye
