program: Orca
programVersion: 5.0.2
elementType: Cl O O N N N N C C C C C C C C C C C H H H H H H H H H H H H H H H
charge: 0
multiplicity: 1
keywords: wb97x-d3
keywords: def2-TZVPP
keywords: def2/J RIJCOSX
keywords: DEFGRID2
keywords: scfconv7
keywords: smallprint printgap noloewdin
keywords: NOSOSCF
formula: C11H15ClN4O2
InChI: InChI=1/C11H15ClN4O2/c1-3-15(11(13-2)8-16(17)18)7-9-4-5-10(12)14-6-9/h4-6,8,13H,3,7H2,1-2H3
33 atoms
Cl 5.005381 -1.082284 0.142777
O  -1.866691 4.065023 0.886546
O  -2.870701 3.315683 -0.853224
N  -1.642909 -0.501652 0.304374
N  -2.721603 0.697705 -1.36006
N  2.704137 -2.288894 0.111924
N  -2.175705 3.153362 0.149054
C  -0.887635 -1.391691 -0.571117
C  -1.362305 -0.621775 1.728231
C  -2.032784 0.720059 -0.204779
C  0.603406 -1.257224 -0.40494
C  -1.579986 -2.034993 2.241364
C  1.258719 -0.041768 -0.598483
C  1.388151 -2.342329 -0.0486
C  -1.697119 1.876699 0.467098
C  2.626126 0.031125 -0.42991
C  -3.56727 -0.392035 -1.788872
C  3.292732 -1.136445 -0.072345
H  -1.152152 -1.176741 -1.605407
H  -1.186717 -2.426482 -0.390283
H  -0.343362 -0.296483 1.972086
H  -2.042818 0.049324 2.250591
H  -1.504902 -2.037762 3.328021
H  -2.570317 -2.402639 1.972598
H  -0.836311 -2.740844 1.8726
H  -2.952467 1.625762 -1.691555
H  0.706069 0.847282 -0.877517
H  0.934369 -3.315442 0.114886
H  -1.027228 1.862078 1.308784
H  3.164152 0.957049 -0.571641
H  -3.737929 -1.094885 -0.975476
H  -3.146074 -0.941595 -2.633524
H  -4.532448 0.004664 -2.100805
totalener: -1257.83444034 hartree
nucrepener: 1450.26328938 hartree
electener: -2708.09772972 hartree
oneelecener: -4599.74092057 hartree
twoeener: 1891.64319086 hartree
kineticenergy: 1253.91424565 hartree
xcener: -97.123098126344 hartree
chargesum: 0.0000000
charge: -0.058939 -0.373619 -0.419621 -0.117509 -0.222585 -0.263111 0.483854 -0.085446 -0.096782 0.224089 0.005460 -0.257126 -0.155778 -0.010628 -0.267286 -0.152204 -0.159510 0.188850 0.136279 0.116994 0.099240 0.112987 0.097765 0.088867 0.077770 0.176260 0.163623 0.101459 0.122752 0.129899 0.106606 0.090962 0.116425
qa: -0.0589 -0.3736 -0.4196 -0.1175 -0.2226 -0.2631 0.4839 -0.0854 -0.0968 0.2241 0.0055 -0.2571 -0.1558 -0.0106 -0.2673 -0.1522 -0.1595 0.1889 0.1363 0.1170 0.0992 0.1130 0.0978 0.0889 0.0778 0.1763 0.1636 0.1015 0.1228 0.1299 0.1066 0.0910 0.1164
va: 1.2415 1.8660 1.8284 2.9981 3.1790 3.0922 4.1330 3.8355 3.8827 3.9555 3.5159 3.9383 3.9810 4.1032 3.8535 3.9936 3.8899 4.1409 0.9940 0.9895 0.9867 0.9955 1.0093 1.0077 1.0065 1.0663 0.9817 1.0103 1.0330 1.0143 1.0079 0.9840 1.0018
dispcorr: -0.016227659 hartree
energy: -1257.850667998470
dipole: -25.97696 25.10828 -0.86867 -9.03365 6.96647 -2.06718 1.64319 -2.07056 -0.42737
magnitude: 2.28264 au
magnitude: 5.80202 debye
