program: Orca
programVersion: 5.0.2
elementType: Cl O O N N N N C C C C C C C C C C C H H H H H H H H H H H H H H H
charge: 0
multiplicity: 1
keywords: wb97x-d3
keywords: def2-TZVPP
keywords: def2/J RIJCOSX
keywords: DEFGRID2
keywords: scfconv7
keywords: smallprint printgap noloewdin
keywords: NOSOSCF
formula: C11H15ClN4O2
InChI: InChI=1/C11H15ClN4O2/c1-3-15(11(13-2)8-16(17)18)7-9-4-5-10(12)14-6-9/h4-6,8,13H,3,7H2,1-2H3
33 atoms
Cl 4.650632 -0.63289 -0.689502
O  -2.249369 3.604226 0.709145
O  -1.571991 2.819307 -1.170404
N  -1.792492 -0.999468 0.552152
N  -1.262434 0.172081 -1.399161
N  2.429607 -1.872869 -0.15995
N  -1.939435 2.674727 -0.005587
C  -0.79697 -1.14334 1.609888
C  -3.143933 -1.329684 0.992124
C  -1.682698 0.23317 -0.141048
C  0.596603 -0.961993 1.084135
C  -4.142988 -1.332646 -0.148549
C  1.307089 0.220313 1.252363
C  1.219966 -1.975441 0.369177
C  -2.004688 1.385227 0.534397
C  2.573242 0.342644 0.710451
C  -0.905281 -1.008889 -2.141767
C  3.075482 -0.745401 0.010324
H  -0.907658 -2.151592 2.016932
H  -0.97063 -0.448886 2.444368
H  -3.09291 -2.330175 1.428582
H  -3.494944 -0.661087 1.791451
H  -4.270756 -0.341667 -0.583661
H  -3.836647 -2.019024 -0.937835
H  -5.117798 -1.654464 0.216258
H  -1.173971 1.075923 -1.847873
H  0.870595 1.047532 1.798142
H  0.712628 -2.922216 0.211188
H  -2.346958 1.348227 1.555433
H  3.15065 1.248803 0.820447
H  -1.419687 -1.009282 -3.102809
H  -1.191905 -1.89744 -1.590298
H  0.169371 -1.046117 -2.327482
totalener: -1257.82994465 hartree
nucrepener: 1486.40732437 hartree
electener: -2744.23726903 hartree
oneelecener: -4672.31906440 hartree
twoeener: 1928.08179537 hartree
kineticenergy: 1253.92818795 hartree
xcener: -97.115678618343 hartree
chargesum: 0.0000000
charge: -0.060499 -0.373306 -0.419198 -0.116948 -0.077768 -0.257509 0.490020 -0.073161 -0.065378 0.024285 0.045082 -0.242976 -0.102729 -0.067107 -0.196027 -0.153709 -0.188427 0.180373 0.102144 0.106000 0.083675 0.080777 0.100105 0.079183 0.094613 0.178945 0.132778 0.113370 0.104795 0.129028 0.126933 0.100098 0.122539
qa: -0.0605 -0.3733 -0.4192 -0.1169 -0.0778 -0.2575 0.4900 -0.0732 -0.0654 0.0243 0.0451 -0.2430 -0.1027 -0.0671 -0.1960 -0.1537 -0.1884 0.1804 0.1021 0.1060 0.0837 0.0808 0.1001 0.0792 0.0946 0.1789 0.1328 0.1134 0.1048 0.1290 0.1269 0.1001 0.1225
va: 1.2393 1.8698 1.8269 2.7940 3.2156 3.0579 4.1254 3.9108 3.9220 4.0564 3.4866 3.9182 3.9844 4.0920 3.8765 4.0102 3.8774 4.1367 1.0017 1.0005 0.9965 0.9998 1.0026 1.0072 1.0079 1.0517 1.0051 1.0111 1.0436 1.0127 0.9963 1.0187 0.9873
dispcorr: -0.017704467 hartree
energy: -1257.847649120268
dipole: -27.71338 26.96500 -0.74838 -9.72442 7.83776 -1.88667 2.42806 -1.91541 0.51265
magnitude: 2.09342 au
magnitude: 5.32105 debye
