program: Gaussian 09
title: 000056812
version: EM64L-G09RevD.01
frameworkgroup: C1[X(C11H9N3)]
method: RPBEPBE
basis: SDD
operation: Freq
keyword: #pfreq=noraman
keyword: PBEPBE/SDD
title: #p freq=noraman PBEPBE/SDD
converged: NO NO NO YES
title: Mulliken charges:
elementType: N N N C C C C C C C C C C C H H H H H H H H H
charge: -0.464027 -0.099052 -0.610855 0.300524 -0.139706 0.299666 0.431800 -0.375030 -0.460091 -0.420428 0.101349 -0.438819 -0.243548 -0.245983 0.225925 0.234188 0.299153 0.268655 0.235682 0.223964 0.221786 0.342113 0.312733
chargesum: 0.00000
title: Mulliken charges with hydrogens summed into heavy atoms:
elementType: N N N C C C C C C C C C C C
charge: -0.164875 -0.099052 0.043991 0.300524 -0.139706 0.299666 0.431800 -0.149104 -0.225903 -0.151773 0.101349 -0.203137 -0.019584 -0.024197
polarizability: 2.29348661e+02 -3.73964332e+00 1.52730041e+02 4.59567248e-03 2.94677002e-03 5.44535801e+01
1716.lowfreq: -5.7450 -0.0009 0.0003 0.0006 11.3099 12.5333 48.8969 98.0260 143.5840
frequency: 48.8226 98.0232 143.5815 185.8065 195.9119 274.7542 348.6859 349.5547 405.9813 414.9045 426.6585 494.4580 513.9602 525.6791 533.6261 572.3609 594.5931 651.9958 686.3240 704.0007 749.2425 753.5993 767.2751 804.7499 809.8726 868.2993 885.3043 935.0118 963.4611 966.7804 991.1294 1002.3934 1018.3326 1039.6710 1093.3059 1141.0141 1169.6927 1194.7132 1226.7141 1241.3267 1274.7779 1315.0543 1380.0684 1396.3928 1397.1653 1431.6351 1447.8107 1459.5047 1534.7464 1573.1399 1577.1240 1605.7430 1630.4232 1650.1371 3115.0758 3125.6098 3129.3719 3147.3820 3149.5177 3162.3531 3580.0349 3599.8696 3727.5950
redmass: 1.1944 4.0694 4.6609 4.4130 4.0755 4.3951 4.6816 3.6370 6.1540 1.3982 2.0806 6.3455 3.4134 4.0281 1.2324 3.1310 5.9065 6.4171 6.3072 3.9682 6.2184 1.3012 5.7043 2.9479 1.5703 4.6027 1.6964 1.3540 3.2659 1.3946 1.3311 4.8458 2.2460 2.4125 2.2046 1.2773 1.0839 2.2563 1.5539 1.6969 1.8077 4.0213 2.3547 4.2372 4.0892 2.9636 3.4283 3.9908 5.0212 2.2904 5.4351 3.0395 3.5656 4.1898 1.0860 1.0866 1.0890 1.0949 1.0974 1.0997 1.0453 1.0807 1.1051
irintensity: 98.0413 14.4768 7.6305 5.4453 6.8949 3.8135 2.3254 3.5675 0.1935 146.4384 85.7040 1.3469 0.0010 0.9307 127.2226 12.2142 3.3291 9.9238 0.1400 19.1215 3.5754 20.5608 7.1451 26.4737 89.3644 3.1992 2.1847 0.0006 0.0207 4.6021 0.2315 12.6989 7.8296 0.5910 14.5513 0.4689 0.2495 6.5640 2.4527 8.6846 3.8509 67.0742 69.5865 23.9831 27.0455 15.2386 16.7045 2.8820 31.4798 116.9778 0.6931 25.0916 254.0216 391.1088 2.1258 1.8698 16.0998 26.7383 31.3488 27.2372 133.1988 39.5101 43.1290
temp: 298.150 k
press: 1.00000 atm
elementType: 7 7 7 6 6 6 6 6 6 6 6 6 6 6 1 1 1 1 1 1 1 1 1
symmnumber: 1
zpe: 467752.5 jmol-1
zpe.correction: 0.178158 hartree
zpe.thermalcorrener: 0.188996 hartree
zpe.thermalcorrenthalpy: 0.189940 hartree
zpe.thermalcorrgfe: 0.141431 hartree
zpe.sumelectzpe: -587.900344 hartree
zpe.sumelectthermal: -587.889505 hartree
zpe.sumelectthermalent: -587.888561 hartree
zpe.sumelectthermalfe: -587.937071 hartree
dipole: -4.8302 2.0169 0.0010
dipole: 5.2344
quadrupole: -47.8254 -72.0496 -88.1670
quadrupole: -2.4340 -0.0042 -0.0008
quadrupole: 21.5219 -2.7022 -18.8197 -2.4340 -0.0042 -0.0008
hfenergy: -588.0785015 hartree
pointgroup: C01 [X(C11H9N3)]
dipole: 1.9083562 -0.7740773 0.000376 debye
dipolederiv: -0.7601914 0.0787999 -0.0000168 -0.1806965 -0.4580642 0.0000252 0.0000269 0.0000218 -0.2960044 -1.3747141 -0.2841258 0.0000316 0.0309055 -0.4002801 -0.0000111 -0.000072 -0.0000174 -0.2860678 -1.7082048 -0.560772 0.0002146 -0.6695782 -0.4333599 -0.00004 0.0006305 0.0000753 -0.7610618 0.1956583 -0.1734062 -0.0000028 -0.0680509 -0.0314282 0.0000029 -0.000002 0.0000089 0.0070837 0.4187172 0.2575922 -0.0000165 0.7713503 0.2380301 -0.0000267 -0.0000006 -0.0000225 -0.0170311 0.6487223 -0.0041685 -0.0000125 -0.4263255 -0.2955747 0.0000089 -0.0000016 0.0000059 0.0363464 -0.0284406 -0.0202507 0.0000012 -0.3043983 -0.0648625 0.0000158 0.000014 0.0000063 0.0491868 0.1478574 0.1511404 -0.0000192 0.2149108 0.1721997 -0.0000187 -0.0000281 -0.0000098 -0.1828541 -0.2199012 -0.0982342 0.000004 0.0351509 0.067187 -0.0000163 -0.0000041 -0.0000094 -0.216401 -0.0918134 0.0716908 -0.0000047 0.0358268 0.0297366 -0.0000059 -0.0000043 -0.000005 -0.1527931 2.1023433 0.5453314 -0.0001024 0.3020961 0.7915648 0.0000013 -0.0001281 0.0000013 0.2093935 0.0551561 0.0117623 -0.0000078 0.1345042 0.0837813 -0.0000123 -0.0000134 -0.0000058 -0.1834822 -0.0386698 -0.0486834 -0.0000051 0.0379152 0.1259507 -0.000013 -0.0000039 -0.0000125 -0.1737454 0.0689675 0.0589919 -0.0000089 0.0081528 -0.0956389 -0.000002 -0.0000011 -0.0000077 -0.1772899 0.0330013 0.1012223 0.0000015 0.0711296 -0.0844221 0.0000061 0.0000047 0.0000045 0.1741785 0.0019917 -0.1243512 0.0000098 -0.0536877 -0.0524486 0.0000099 0.0000087 0.0000122 0.164008 0.1637192 -0.0068851 0.0000083 0.0018242 0.1410241 0.0000017 0.0000139 -0.0000033 0.3611561 0.0647104 -0.0916324 0.0000063 -0.0394469 -0.0113932 0.0000062 0.0000047 0.0000056 0.1571839 0.0135808 -0.0554634 0.0000063 -0.1333472 -0.07105 0.0000114 0.0000092 0.0000078 0.1551335 0.0240439 0.0944713 0.0000011 0.1116933 -0.1003472 0.0000055 -0.000001 0.0000081 0.1596806 -0.1702306 0.0193124 0.0000092 0.0191842 0.0866406 0.0000022 0.000006 0.0000028 0.1629539 0.1986608 0.0447044 -0.0000344 0.1130821 0.2314491 -0.0000127 -0.0001339 -0.0000782 0.3999511 0.2550355 0.0329537 -0.0000628 -0.0121946 0.1313055 0.0000615 -0.0003246 0.0000109 0.4104746 unknown
polarizability: 229.4169935|-2.9571499|152.6617087|-0.0045654|-0.0029935|54.4535801 unknown
InChI: InChI=1S/C11H9N3/c12-11-13-9-6-5-7-3-1-2-4-8(7)10(9)14-11/h1-6,13H,12H2
charge 0 multiplicity 1
23 atoms
N  2.682205 -0.813461 -0.000155
N  1.697485 1.252696 -0.000168
N  4.111051 1.170387 -0.000237
C  -0.721946 0.397934 -0.000101
C  0.702172 0.250136 -0.000132
C  1.288063 -1.04611 -0.000114
C  -1.51367 -0.820508 -0.000031
C  0.523562 -2.241527 -0.000043
C  -0.869818 -2.110069 -0.000004
C  -1.375387 1.669229 -0.000119
C  2.863836 0.578855 -0.000179
C  -2.942976 -0.700343 0.00002
C  -2.771613 1.746982 -0.000067
C  -3.561496 0.553378 0.0000
H  0.995762 -3.230031 -0.000025
H  -1.501067 -3.006283 0.000052
H  3.407732 -1.526971 -0.000191
H  -0.754053 2.570777 -0.000164
H  -3.548745 -1.615119 0.000069
H  -3.267409 2.72432 -0.000085
H  -4.655037 0.626278 0.000028
H  4.14384 2.18534 -0.000132
H  4.973909 0.63751 0.000178
