program: Orca
programVersion: 5.0.2
elementType: Cl O O N N N N C C C C C C C C C C C H H H H H H H H H H H H H H H
charge: 0
multiplicity: 1
keywords: wb97x-d3
keywords: def2-TZVPP
keywords: def2/J RIJCOSX
keywords: DEFGRID2
keywords: scfconv7
keywords: smallprint printgap noloewdin
keywords: NOSOSCF
formula: C11H15ClN4O2
InChI: InChI=1/C11H15ClN4O2/c1-3-15(11(13-2)8-16(17)18)7-9-4-5-10(12)14-6-9/h4-6,8,13H,3,7H2,1-2H3
33 atoms
Cl 4.975081 -1.056033 -0.890433
O  -2.154511 3.43683 -1.650677
O  -2.787054 3.292134 0.392246
N  -1.570924 -0.699195 0.312662
N  -2.391673 0.990727 1.669613
N  2.825993 -2.238122 -0.033119
N  -2.277788 2.810007 -0.619689
C  -0.572874 -1.23566 1.232223
C  -1.580686 -1.318353 -1.00603
C  -1.933757 0.625137 0.460274
C  0.833243 -1.129816 0.704068
C  -2.962737 -1.352937 -1.633985
C  1.430113 0.101825 0.438148
C  1.587451 -2.262247 0.441834
C  -1.799625 1.495584 -0.600991
C  2.715632 0.143232 -0.061517
C  -3.017404 0.104533 2.62097
C  3.362274 -1.070182 -0.273261
H  -0.808661 -2.283687 1.436045
H  -0.641977 -0.7122 2.184838
H  -0.85211 -0.864365 -1.687331
H  -1.238741 -2.344931 -0.861369
H  -2.921543 -1.887778 -2.582473
H  -3.668122 -1.870837 -0.984588
H  -3.352698 -0.356854 -1.834675
H  -2.621307 1.97584 1.717817
H  0.895589 1.026298 0.619874
H  1.173675 -3.249264 0.626296
H  -1.318176 1.196075 -1.515144
H  3.207462 1.080207 -0.278515
H  -3.295119 -0.836536 2.149932
H  -3.923362 0.57324 3.002468
H  -2.374032 -0.116586 3.475601
totalener: -1257.83378419 hartree
nucrepener: 1450.83399938 hartree
electener: -2708.66778357 hartree
oneelecener: -4600.96245583 hartree
twoeener: 1892.29467227 hartree
kineticenergy: 1253.91431274 hartree
xcener: -97.122050270475 hartree
chargesum: 0.0000000
charge: -0.058931 -0.374488 -0.420773 -0.106175 -0.214666 -0.264046 0.488815 -0.083108 -0.084974 0.201532 -0.002443 -0.241793 -0.142216 -0.000631 -0.270325 -0.157420 -0.160830 0.190792 0.109398 0.131187 0.092917 0.085962 0.092262 0.078531 0.105974 0.177349 0.159178 0.099673 0.123664 0.130257 0.107966 0.115620 0.091742
qa: -0.0589 -0.3745 -0.4208 -0.1062 -0.2147 -0.2640 0.4888 -0.0831 -0.0850 0.2015 -0.0024 -0.2418 -0.1422 -0.0006 -0.2703 -0.1574 -0.1608 0.1908 0.1094 0.1312 0.0929 0.0860 0.0923 0.0785 0.1060 0.1773 0.1592 0.0997 0.1237 0.1303 0.1080 0.1156 0.0917
va: 1.2414 1.8661 1.8261 2.9652 3.1813 3.0887 4.1260 3.8713 3.9168 3.9455 3.5405 3.9292 3.9721 4.0979 3.8482 3.9957 3.8910 4.1418 0.9975 0.9924 0.9906 0.9963 1.0086 1.0072 1.0033 1.0669 0.9829 1.0124 1.0359 1.0143 1.0072 1.0021 0.9837
dispcorr: -0.016214395 hartree
energy: -1257.849998580686
dipole: -27.36769 26.71267 -0.65502 -6.74197 4.94852 -1.79345 6.29949 -4.96292 1.33658
magnitude: 2.33065 au
magnitude: 5.92405 debye
