program: Orca
programVersion: 5.0.2
elementType: Cl O O N N N N C C C C C C C C C C C H H H H H H H H H H H H H H H
charge: 0
multiplicity: 1
keywords: wb97x-d3
keywords: def2-TZVPP
keywords: def2/J RIJCOSX
keywords: DEFGRID2
keywords: scfconv7
keywords: smallprint printgap noloewdin
keywords: NOSOSCF
formula: C11H15ClN4O2
InChI: InChI=1/C11H15ClN4O2/c1-3-15(11(13-2)8-16(17)18)7-9-4-5-10(12)14-6-9/h4-6,8,13H,3,7H2,1-2H3
33 atoms
Cl 4.804291 -0.571305 -0.812477
O  -1.711024 3.838034 -0.833294
O  -2.396659 3.267717 1.116024
N  -1.763859 -0.703512 -0.010663
N  -2.362116 0.679084 1.752105
N  2.551314 -0.010395 0.355285
N  -1.937807 2.994772 0.007373
C  -0.849578 -1.57249 0.728318
C  -1.798702 -0.91245 -1.450927
C  -1.9331 0.579502 0.480916
C  0.590919 -1.387414 0.326943
C  -2.254006 -2.314615 -1.81962
C  1.273794 -2.321096 -0.44367
C  1.294135 -0.245855 0.698602
C  -1.650452 1.662762 -0.320301
C  2.587389 -2.090561 -0.808141
C  -3.158693 -0.312062 2.43446
C  3.167116 -0.90565 -0.375887
H  -1.148579 -2.611151 0.57971
H  -0.957017 -1.378254 1.79396
H  -2.509342 -0.19875 -1.865472
H  -0.828871 -0.702351 -1.919529
H  -1.526724 -3.084935 -1.563874
H  -3.196633 -2.559933 -1.330622
H  -2.408697 -2.372322 -2.896457
H  -2.443064 1.639687 2.060776
H  0.78357 -3.235104 -0.758089
H  0.824327 0.515683 1.312565
H  -1.164592 1.54594 -1.272908
H  3.143863 -2.799009 -1.404138
H  -3.548302 -1.047289 1.73272
H  -4.003513 0.177252 2.917576
H  -2.596339 -0.840576 3.207862
totalener: -1257.83252391 hartree
nucrepener: 1458.30634415 hartree
electener: -2716.13886806 hartree
oneelecener: -4616.04725958 hartree
twoeener: 1899.90839152 hartree
kineticenergy: 1253.90862122 hartree
xcener: -97.120131952569 hartree
chargesum: -0.0000000
charge: -0.059112 -0.371398 -0.418565 -0.104853 -0.214023 -0.252214 0.481709 -0.103052 -0.108171 0.179606 -0.000249 -0.253135 -0.135658 -0.011765 -0.214575 -0.157327 -0.161457 0.183692 0.120165 0.142171 0.112994 0.102474 0.066520 0.092047 0.098093 0.177634 0.121472 0.128236 0.119760 0.125466 0.107389 0.114532 0.091596
qa: -0.0591 -0.3714 -0.4186 -0.1049 -0.2140 -0.2522 0.4817 -0.1031 -0.1082 0.1796 -0.0002 -0.2531 -0.1357 -0.0118 -0.2146 -0.1573 -0.1615 0.1837 0.1202 0.1422 0.1130 0.1025 0.0665 0.0920 0.0981 0.1776 0.1215 0.1282 0.1198 0.1255 0.1074 0.1145 0.0916
va: 1.2406 1.8691 1.8297 2.9916 3.1609 3.0809 4.1355 3.8531 3.8917 3.9863 3.4888 3.9362 3.9962 4.0743 3.8592 4.0212 3.8890 4.1478 0.9918 0.9966 0.9996 0.9855 1.0065 1.0087 1.0093 1.0655 1.0074 1.0006 1.0346 1.0141 1.0094 1.0026 0.9850
dispcorr: -0.016292978 hartree
energy: -1257.848816885755
dipole: -26.81444 25.84298 -0.97146 -15.00816 11.60809 -3.40008 1.70179 -1.50231 0.19948
magnitude: 3.54176 au
magnitude: 9.00243 debye
