program: Orca
programVersion: 5.0.2
elementType: Cl O O N N N N C C C C C C C C C C C H H H H H H H H H H H H H H H
charge: 0
multiplicity: 1
keywords: wb97x-d3
keywords: def2-TZVPP
keywords: def2/J RIJCOSX
keywords: DEFGRID2
keywords: scfconv7
keywords: smallprint printgap noloewdin
keywords: NOSOSCF
formula: C11H15ClN4O2
InChI: InChI=1/C11H15ClN4O2/c1-3-15(11(13-2)8-16(17)18)7-9-4-5-10(12)14-6-9/h4-6,8,13H,3,7H2,1-2H3
33 atoms
Cl 4.982556 -1.093922 0.202243
O  -2.027639 3.579136 2.042419
O  -2.850265 3.467382 0.066917
N  -1.633539 -0.521341 -0.025911
N  -2.570471 1.185741 -1.283629
N  2.638855 -0.00525 -0.077527
N  -2.243683 2.971653 1.015876
C  -0.822153 -1.093557 -1.091791
C  -1.49056 -1.130246 1.288195
C  -2.000419 0.804255 -0.125623
C  0.64945 -1.14727 -0.764898
C  -1.737736 -2.628941 1.257752
C  1.375723 -2.327691 -0.859564
C  1.346555 -0.010626 -0.368254
C  -1.762843 1.658655 0.929819
C  2.727345 -2.335129 -0.568771
C  -3.367838 0.325733 -2.127028
C  3.298157 -1.132622 -0.176936
H  -0.960871 -0.499182 -1.993809
H  -1.178436 -2.09822 -1.331951
H  -0.504519 -0.931182 1.725473
H  -2.226745 -0.665881 1.943088
H  -0.95618 -3.177153 0.732193
H  -1.759794 -3.010086 2.277965
H  -2.696093 -2.860543 0.792508
H  -2.783246 2.175394 -1.299264
H  0.887573 -3.246462 -1.163868
H  0.84019 0.944702 -0.271959
H  -1.171537 1.357339 1.776678
H  3.317488 -3.237293 -0.636029
H  -2.8722 0.089025 -3.070995
H  -4.307288 0.824547 -2.362563
H  -3.601321 -0.608895 -1.620143
totalener: -1257.83268870 hartree
nucrepener: 1448.40583498 hartree
electener: -2706.23852368 hartree
oneelecener: -4596.15125966 hartree
twoeener: 1889.91273597 hartree
kineticenergy: 1253.91008857 hartree
xcener: -97.122470041299 hartree
chargesum: -0.0000000
charge: -0.059208 -0.372400 -0.419323 -0.122677 -0.228895 -0.252925 0.482060 -0.077234 -0.095370 0.237308 0.019457 -0.256973 -0.137219 -0.038964 -0.269466 -0.163598 -0.158010 0.184217 0.137988 0.113752 0.100572 0.112717 0.074745 0.097984 0.088950 0.175464 0.122283 0.141515 0.126088 0.125641 0.090686 0.116979 0.103855
qa: -0.0592 -0.3724 -0.4193 -0.1227 -0.2289 -0.2529 0.4821 -0.0772 -0.0954 0.2373 0.0195 -0.2570 -0.1372 -0.0390 -0.2695 -0.1636 -0.1580 0.1842 0.1380 0.1138 0.1006 0.1127 0.0747 0.0980 0.0889 0.1755 0.1223 0.1415 0.1261 0.1256 0.0907 0.1170 0.1039
va: 1.2407 1.8679 1.8287 3.0056 3.1843 3.0815 4.1375 3.8133 3.8796 3.9539 3.5042 3.9374 4.0050 4.0833 3.8625 4.0209 3.8917 4.1437 0.9942 0.9882 0.9874 0.9962 1.0055 1.0097 1.0074 1.0679 1.0089 0.9944 1.0305 1.0142 0.9837 1.0020 1.0071
dispcorr: -0.016129328 hartree
energy: -1257.848818030390
dipole: -25.69316 24.95604 -0.73711 -12.49548 9.30168 -3.19380 -4.46026 3.06812 -1.39214
magnitude: 3.56115 au
magnitude: 9.05171 debye
