program: Orca
programVersion: 5.0.2
elementType: Cl O O N N N N C C C C C C C C C C C H H H H H H H H H H H H H H H
charge: 0
multiplicity: 1
keywords: wb97x-d3
keywords: def2-TZVPP
keywords: def2/J RIJCOSX
keywords: DEFGRID2
keywords: scfconv7
keywords: smallprint printgap noloewdin
keywords: NOSOSCF
formula: C11H15ClN4O2
InChI: InChI=1/C11H15ClN4O2/c1-3-15(11(13-2)8-16(17)18)7-9-4-5-10(12)14-6-9/h4-6,8,13H,3,7H2,1-2H3
33 atoms
Cl 5.07082 -1.336147 0.097685
O  -1.147775 3.89634 -0.968448
O  -2.879295 3.433755 0.206436
N  -1.65804 -0.554517 0.084328
N  -3.212117 0.915879 0.993927
N  2.855306 -1.889906 -1.144144
N  -1.832924 3.10608 -0.354509
C  -0.759411 -0.88788 -0.996691
C  -1.749395 -1.546402 1.15138
C  -2.092086 0.733066 0.264846
C  0.704337 -0.961968 -0.631083
C  -2.464973 -2.826766 0.750318
C  1.279617 -0.229262 0.402646
C  1.552986 -1.784062 -1.360436
C  -1.380986 1.783407 -0.287655
C  2.635815 -0.335584 0.646135
C  -4.354319 0.027623 0.960268
C  3.372128 -1.18223 -0.171682
H  -0.90994 -0.17029 -1.805152
H  -1.062658 -1.854895 -1.407737
H  -0.735878 -1.796654 1.482754
H  -2.233938 -1.089105 2.011084
H  -2.51382 -3.501581 1.604633
H  -3.482237 -2.638801 0.410848
H  -1.9403 -3.359497 -0.042673
H  -3.424571 1.902247 1.089569
H  0.679126 0.425701 1.021907
H  1.161025 -2.393101 -2.169825
H  -0.409645 1.646943 -0.729955
H  3.109603 0.221973 1.440821
H  -4.404777 -0.533435 0.026566
H  -5.256888 0.63034 1.034311
H  -4.367473 -0.682584 1.788458
totalener: -1257.83325463 hartree
nucrepener: 1441.64655551 hartree
electener: -2699.47981013 hartree
oneelecener: -4582.45637123 hartree
twoeener: 1882.97656110 hartree
kineticenergy: 1253.90374026 hartree
xcener: -97.125088921536 hartree
chargesum: 0.0000000
charge: -0.060167 -0.376056 -0.418081 -0.112754 -0.246469 -0.263625 0.474578 -0.078999 -0.074801 0.294638 0.023254 -0.251905 -0.157231 -0.031819 -0.311647 -0.160287 -0.151820 0.191983 0.129155 0.110288 0.108906 0.110295 0.095615 0.087293 0.085391 0.176593 0.154511 0.102405 0.120202 0.127812 0.102158 0.115073 0.085511
qa: -0.0602 -0.3761 -0.4181 -0.1128 -0.2465 -0.2636 0.4746 -0.0790 -0.0748 0.2946 0.0233 -0.2519 -0.1572 -0.0318 -0.3116 -0.1603 -0.1518 0.1920 0.1292 0.1103 0.1089 0.1103 0.0956 0.0873 0.0854 0.1766 0.1545 0.1024 0.1202 0.1278 0.1022 0.1151 0.0855
va: 1.2396 1.8631 1.8271 3.0675 3.2020 3.0843 4.1492 3.8564 3.8297 3.9416 3.4829 3.9282 3.9542 4.1396 3.8578 4.0474 3.9107 4.1396 0.9953 0.9893 1.0004 1.0020 1.0087 1.0041 1.0033 1.0742 0.9947 1.0094 1.0309 1.0147 0.9985 1.0054 0.9777
dispcorr: -0.015831584 hartree
energy: -1257.849086209917
dipole: -30.91187 29.49617 -1.41570 -10.09373 7.79175 -2.30199 5.25841 -4.35748 0.90092
magnitude: 2.84869 au
magnitude: 7.24079 debye
