program: Gaussian 09
title: 000056800
version: EM64L-G09RevD.01
frameworkgroup: C1[X(C14H9NO5)]
method: RPBEPBE
basis: SDD
operation: Freq
keyword: #p
keyword: freq=noraman
keyword: PBEPBE/SDD
title: #p freq=noraman PBEPBE/SDD
converged: NO YES YES YES
title: Mulliken charges:
elementType: O O O O O N C C C C C C C C C C C C C C H H H H H H H H H
charge: -0.250766 -0.258447 -0.135481 -0.230792 -0.163290 0.035971 0.291061 0.224668 0.442253 0.161064 -0.428343 -0.385184 -0.372292 -0.319939 -0.577827 0.329872 -0.377501 0.156949 0.105407 -0.535550 0.256126 0.234869 0.275701 0.291211 0.272061 0.252868 0.225929 0.225929 0.253474
chargesum: 0.00000
title: Mulliken charges with hydrogens summed into heavy atoms:
elementType: O O O O O N C C C C C C C C C C C C C C
charge: -0.250766 -0.258447 -0.135481 -0.230792 -0.163290 0.035971 0.291061 0.224668 0.442253 0.161064 -0.172217 -0.150315 -0.096591 -0.028727 -0.305766 0.329872 -0.124633 0.156949 0.105407 0.169782
polarizability: 3.65155740e+02 3.66629664e+00 2.05738929e+02 2.64046617e-02 6.68622500e-03 7.06089329e+01
1716.lowfreq: -8.9812 -5.6816 -3.1965 -0.0006 0.0008 0.0009 4.9797 39.0059 55.6234
frequency: -8.6043 39.0046 55.6218 83.6408 104.5563 134.0257 153.0596 197.8445 213.2295 232.6564 265.6543 279.3081 287.4776 318.6469 371.3595 374.9567 384.8918 416.3719 429.6404 466.1838 512.2146 522.8390 537.6321 556.3830 592.0894 601.7601 647.4006 662.6076 693.2746 708.8197 721.7570 726.8938 756.7645 783.9717 816.1990 826.2101 827.4125 830.8496 900.6004 906.2722 951.3806 972.4388 974.1372 984.4014 1004.3482 1068.2487 1097.0188 1110.9368 1143.3201 1168.5622 1177.5661 1183.3015 1227.1436 1243.3787 1265.7994 1276.8183 1322.6384 1364.9383 1388.1361 1398.2363 1423.2586 1432.7842 1443.2266 1462.9707 1469.8252 1471.1865 1519.7387 1560.9081 1579.5535 1594.9501 1635.2996 1726.2119 2968.0923 3060.1323 3132.9868 3143.2376 3145.4225 3159.0029 3168.3362 3172.6737 3182.2800
redmass: 15.2868 7.6293 4.7721 4.2544 6.6792 6.1958 4.2452 5.2827 1.8297 2.1243 8.5656 6.2760 4.8115 10.2740 6.2614 4.1582 5.4580 9.7456 3.0587 7.2232 6.9948 3.3119 5.9398 6.9926 3.5173 7.8241 9.3679 8.5564 3.6878 7.4441 7.8771 9.3498 8.5440 2.3814 10.3109 1.9409 6.4695 1.4474 1.6713 4.2662 1.4231 1.4084 5.5826 1.3934 3.7467 4.2245 2.2419 1.2564 1.4259 1.2877 2.3627 3.9574 1.9975 1.9864 3.3605 1.7897 1.9542 8.7932 3.4678 4.9139 4.7900 2.0491 2.2530 2.4884 1.0498 1.1461 3.9268 7.2696 7.6370 6.4613 6.6345 12.9231 1.0327 1.1046 1.0998 1.0900 1.0884 1.0923 1.0913 1.0938 1.0962
irintensity: 0.0992 0.0009 0.4220 8.2127 2.7420 1.9968 0.8120 1.1505 0.0974 2.0629 1.4350 0.8341 11.0734 1.1753 2.0673 0.5066 0.2206 1.2190 5.2644 0.1481 1.0808 4.5380 7.0625 9.5093 0.0500 37.3773 0.8010 5.1200 4.6681 14.3202 13.7413 16.4010 50.1628 0.7106 15.8330 40.5616 4.7475 25.9796 48.1649 2.1526 0.5812 15.3971 16.7707 0.8239 58.2173 37.0825 68.3472 0.1212 0.3710 109.3311 256.5534 299.4189 53.5923 26.2040 267.4055 11.0967 15.4234 28.3341 2.6208 96.1582 98.9747 2.0619 7.6451 19.0853 15.1687 40.3011 161.0833 158.7793 15.6437 239.0930 64.7189 601.2145 70.0505 42.6704 23.7771 4.1662 6.1599 3.0108 6.5884 4.1979 2.6659
temp: 298.150 k
press: 1.00000 atm
elementType: 8 8 8 8 8 7 6 6 6 6 6 6 6 6 6 6 6 6 6 6 1 1 1 1 1 1 1 1 1
symmnumber: 1
zpe: 530633.0 jmol-1
zpe.correction: 0.202107 hartree
zpe.thermalcorrener: 0.217499 hartree
zpe.thermalcorrenthalpy: 0.218443 hartree
zpe.thermalcorrgfe: 0.159065 hartree
zpe.sumelectzpe: -968.277820 hartree
zpe.sumelectthermal: -968.262429 hartree
zpe.sumelectthermalent: -968.261485 hartree
zpe.sumelectthermalfe: -968.320862 hartree
dipole: 10.7039 0.1481 0.0008
dipole: 10.7049
quadrupole: -136.2775 -109.2251 -114.9632
quadrupole: -13.8320 -0.0048 0.0002
quadrupole: -16.1222 10.9302 5.1920 -13.8320 -0.0048 0.0002
hfenergy: -968.4799277 hartree
pointgroup: C01 [X(C14H9N1O5)]
dipole: -4.2116431 -0.0045784 -0.0003002 debye
polarizability: 365.2296415|-1.2865317|205.6650278|0.0265015|-0.0062915|70.6089329 unknown
InChI: InChI=1S/C14H9NO5/c1-19-9-3-4-10-8(6-9)2-5-13-11(10)7-12(15(17)18)14(16)20-13/h2-7H,1H3
charge 0 multiplicity 1
29 atoms
O  2.270243 1.835675 -0.000047
O  -5.245164 -0.426517 -0.000181
O  4.495261 1.220629 -0.00004
O  3.134026 -2.905067 -0.000009
O  4.955829 -1.531901 0.001623
N  3.686316 -1.727971 0.000943
C  -1.007317 -0.011329 -0.000039
C  0.430907 0.218848 0.000006
C  -1.894198 1.131912 -0.0001
C  0.915554 1.556093 -0.000009
C  -1.333621 2.461573 -0.0001
C  -1.592703 -1.310039 -0.000022
C  0.039121 2.679563 -0.000053
C  1.412047 -0.818052 0.000235
C  -3.303795 0.941898 -0.000149
C  -3.849676 -0.351678 -0.000135
C  -2.982327 -1.487603 -0.000073
C  2.777264 -0.557906 0.000286
C  3.337334 0.796696 -0.000282
C  -5.866818 -1.756981 -0.000181
H  -2.018662 3.316829 -0.000129
H  -0.957943 -2.201486 0.000019
H  0.471616 3.683283 -0.000059
H  1.125562 -1.873749 0.000506
H  -3.980418 1.802162 -0.000197
H  -3.390476 -2.502183 -0.000069
H  -5.591335 -2.329091 0.906214
H  -5.591265 -2.329126 -0.906532
H  -6.948863 -1.562984 -0.000226
