program: Orca
programVersion: 5.0.2
elementType: N N C C C C C C C C C C H H H H H H H H H H H H H H
charge: 0
multiplicity: 1
keywords: wb97x-d3
keywords: def2-TZVPP
keywords: def2/J RIJCOSX
keywords: DEFGRID2
keywords: scfconv7
keywords: smallprint printgap noloewdin
keywords: NOSOSCF
formula: C10H14N2
InChI: InChI=1/C10H14N2/c1-12-7-3-5-10(12)9-4-2-6-11-8-9/h2,4,6,8,10H,3,5,7H2,1H3
26 atoms
N  1.823053 0.768564 -0.180836
N  -2.141822 -0.985361 1.080098
C  0.886502 -0.009611 -0.996799
C  1.581219 -1.373338 -1.067388
C  2.405925 -1.474152 0.232443
C  2.236389 -0.109607 0.900335
C  -0.520847 -0.057249 -0.438899
C  1.352877 2.055803 0.270966
C  -1.468425 0.869353 -0.861871
C  -0.929202 -0.963966 0.536104
C  -2.738045 0.859643 -0.308642
C  -3.024141 -0.084548 0.66291
H  0.820878 0.448967 -1.987116
H  2.238166 -1.394558 -1.936276
H  0.87365 -2.192948 -1.187418
H  2.060381 -2.278442 0.881346
H  3.453242 -1.674088 0.008564
H  1.4864 -0.159256 1.705348
H  3.156547 0.257585 1.359167
H  1.011888 2.654288 -0.574707
H  2.172022 2.600052 0.743146
H  0.532777 2.004326 1.000052
H  -1.211504 1.593678 -1.626213
H  -0.249401 -1.728886 0.895111
H  -3.493144 1.567528 -0.621984
H  -4.005919 -0.119008 1.120647
elementType: N C H
totalener: -499.03083831 hartree
nucrepener: 713.74685745 hartree
electener: -1212.77769576 hartree
oneelecener: -2089.63773908 hartree
twoeener: 876.86004332 hartree
cpcmener: -0.01515545 hartree
kineticenergy: 496.70940156 hartree
xcener: -50.248888185537 hartree
chargesum: 0.0000000
charge: -0.241448 -0.379694 0.302122 -0.227005 -0.122682 -0.151033 -0.123155 -0.216195 -0.199672 -0.000316 -0.137459 -0.000253 0.098734 0.088517 0.089753 0.077315 0.082110 0.085459 0.096388 0.105226 0.110790 0.081702 0.148547 0.129503 0.157761 0.144986
qa: -0.2414 -0.3797 0.3021 -0.2270 -0.1227 -0.1510 -0.1232 -0.2162 -0.1997 -0.0003 -0.1375 -0.0003 0.0987 0.0885 0.0898 0.0773 0.0821 0.0855 0.0964 0.1052 0.1108 0.0817 0.1485 0.1295 0.1578 0.1450
va: 2.9428 3.0760 3.6338 3.9825 3.8662 3.9917 3.5876 3.9571 3.9588 3.9841 3.8974 4.0048 1.0029 1.0046 1.0096 1.0136 1.0099 1.0003 1.0069 0.9933 0.9970 0.9902 1.0035 1.0179 0.9909 0.9989
dispcorr: -0.010748651 hartree
energy: -499.041586960345
dipole: 8.14854 -7.96404 0.18450 1.87745 -1.14944 0.72800 -0.16222 -0.53134 -0.69356
magnitude: 1.02228 au
magnitude: 2.59843 debye
