program: Orca
programVersion: 5.0.2
elementType: N N C C C C C C C C C C H H H H H H H H H H H H H H
charge: 0
multiplicity: 1
keywords: wb97x-d3
keywords: def2-TZVPP
keywords: def2/J RIJCOSX
keywords: DEFGRID2
keywords: scfconv7
keywords: smallprint printgap noloewdin
keywords: NOSOSCF
formula: C10H14N2
InChI: InChI=1/C10H14N2/c1-12-7-3-5-10(12)9-4-2-6-11-8-9/h2,4,6,8,10H,3,5,7H2,1H3
26 atoms
N  1.61305 0.723289 0.208947
N  -2.456555 0.002338 1.335941
C  0.82166 -0.278103 -0.497481
C  1.416851 -1.619219 -0.029204
C  2.817541 -1.260696 0.49675
C  2.971508 0.212164 0.143541
C  -0.653168 -0.136822 -0.248107
C  1.477754 2.041982 -0.364108
C  -1.564327 -0.048607 -1.290202
C  -1.166553 -0.103254 1.046204
C  -2.918242 0.059249 -1.005222
C  -3.312931 0.078904 0.320033
H  0.98503 -0.18767 -1.585505
H  1.448622 -2.325344 -0.857564
H  0.806015 -2.071191 0.752073
H  2.865664 -1.398678 1.576799
H  3.60538 -1.868879 0.055026
H  3.628308 0.754812 0.825627
H  3.393378 0.319608 -0.869385
H  2.091081 2.757045 0.185111
H  0.444186 2.384202 -0.299253
H  1.779477 2.083431 -1.421683
H  -1.218494 -0.062278 -2.317069
H  -0.49572 -0.171615 1.894916
H  -3.65349 0.130008 -1.794913
H  -4.361874 0.168255 0.577184
elementType: N C H
totalener: -499.03371783 hartree
nucrepener: 701.05641391 hartree
electener: -1200.09013174 hartree
oneelecener: -2064.37104356 hartree
twoeener: 864.28091181 hartree
cpcmener: -0.01532001 hartree
kineticenergy: 496.71702264 hartree
xcener: -50.245535582682 hartree
chargesum: -0.0000000
charge: -0.255214 -0.378615 0.178478 -0.141279 -0.123679 -0.095538 -0.051192 -0.203028 -0.143201 -0.051530 -0.150361 0.008351 0.086340 0.084598 0.081954 0.074067 0.075114 0.089145 0.071483 0.103463 0.102044 0.077311 0.142389 0.117127 0.156340 0.145434
qa: -0.2552 -0.3786 0.1785 -0.1413 -0.1237 -0.0955 -0.0512 -0.2030 -0.1432 -0.0515 -0.1504 0.0084 0.0863 0.0846 0.0820 0.0741 0.0751 0.0891 0.0715 0.1035 0.1020 0.0773 0.1424 0.1171 0.1563 0.1454
va: 2.8820 3.0649 3.6507 3.9301 3.9090 3.9579 3.5690 3.9574 3.9475 4.0983 3.9047 3.9889 1.0208 1.0150 1.0076 1.0132 1.0173 1.0018 1.0087 0.9939 0.9925 1.0063 1.0115 1.0402 0.9925 0.9992
dispcorr: -0.009936899 hartree
energy: -499.043654728024
dipole: 10.75316 -9.94667 0.80648 0.64488 -0.77404 -0.12915 -3.16346 1.55387 -1.60959
magnitude: 1.80496 au
magnitude: 4.58783 debye
