program: Orca
programVersion: 5.0.2
elementType: N N C C C C C C C C C C H H H H H H H H H H H H H H
charge: 0
multiplicity: 1
keywords: wb97x-d3
keywords: def2-TZVPP
keywords: def2/J RIJCOSX
keywords: DEFGRID2
keywords: scfconv7
keywords: smallprint printgap noloewdin
keywords: NOSOSCF
formula: C10H14N2
InChI: InChI=1/C10H14N2/c1-12-7-3-5-10(12)9-4-2-6-11-8-9/h2,4,6,8,10H,3,5,7H2,1H3
26 atoms
N  1.770897 0.634679 -0.561505
N  -2.766338 0.454752 -0.7783
C  0.87745 -0.490409 -0.829263
C  1.626765 -1.661823 -0.181597
C  2.488076 -1.030425 0.931723
C  2.261821 0.476507 0.792454
C  -0.527022 -0.291706 -0.299029
C  1.268582 1.948445 -0.867257
C  -0.891051 -0.501455 1.02823
C  -1.521515 0.185716 -1.149087
C  -2.186323 -0.218616 1.432722
C  -3.086654 0.260239 0.494772
H  0.800608 -0.622959 -1.9130
H  2.259512 -2.142587 -0.927667
H  0.946327 -2.427153 0.19162
H  2.208438 -1.384786 1.924068
H  3.539554 -1.281389 0.791753
H  1.543486 0.837795 1.546163
H  3.176183 1.058142 0.933642
H  2.072752 2.680126 -0.766711
H  0.442717 2.280314 -0.221136
H  0.920226 1.99084 -1.900816
H  -0.182876 -0.893407 1.747825
H  -1.29069 0.351532 -2.197854
H  -2.496326 -0.370777 2.457921
H  -4.107108 0.490226 0.781108
elementType: N C H
totalener: -499.03236017 hartree
nucrepener: 712.59193253 hartree
electener: -1211.62429270 hartree
oneelecener: -2087.23863013 hartree
twoeener: 875.61433743 hartree
cpcmener: -0.01328305 hartree
kineticenergy: 496.69901491 hartree
xcener: -50.247152596463 hartree
chargesum: -0.0000000
charge: -0.238122 -0.367296 0.289080 -0.222994 -0.123968 -0.143362 -0.134834 -0.211445 -0.108447 -0.045834 -0.185233 0.017134 0.099148 0.089216 0.088817 0.075819 0.082349 0.080378 0.094560 0.109134 0.080381 0.102511 0.154789 0.121294 0.153037 0.143887
qa: -0.2381 -0.3673 0.2891 -0.2230 -0.1240 -0.1434 -0.1348 -0.2114 -0.1084 -0.0458 -0.1852 0.0171 0.0991 0.0892 0.0888 0.0758 0.0823 0.0804 0.0946 0.1091 0.0804 0.1025 0.1548 0.1213 0.1530 0.1439
va: 2.9450 3.0680 3.6560 3.9797 3.8667 3.9922 3.6122 3.9601 3.8417 4.0845 3.9555 3.9867 1.0008 1.0045 1.0100 1.0140 1.0102 0.9996 1.0061 0.9959 0.9898 0.9939 0.9970 1.0139 0.9945 0.9990
dispcorr: -0.010763757 hartree
energy: -499.043123925459
dipole: 9.24427 -8.49012 0.75415 0.54234 -0.96843 -0.42609 2.29160 -1.28604 1.00556
magnitude: 1.32720 au
magnitude: 3.37346 debye
