program: Orca
programVersion: 5.0.2
elementType: N N C C C C C C C C C C H H H H H H H H H H H H H H
charge: 0
multiplicity: 1
keywords: wb97x-d3
keywords: def2-TZVPP
keywords: def2/J RIJCOSX
keywords: DEFGRID2
keywords: scfconv7
keywords: smallprint printgap noloewdin
keywords: NOSOSCF
formula: C10H14N2
InChI: InChI=1/C10H14N2/c1-12-7-3-5-10(12)9-4-2-6-11-8-9/h2,4,6,8,10H,3,5,7H2,1H3
26 atoms
N  1.625793 0.738811 0.114145
N  -2.327641 0.181709 1.388224
C  0.817428 -0.195889 -0.64563
C  1.421976 -1.586211 -0.316128
C  2.628405 -1.289762 0.582855
C  2.941612 0.162027 0.261902
C  -0.643613 -0.080723 -0.30092
C  1.590909 2.091186 -0.370676
C  -1.63235 -0.21289 -1.26395
C  -1.059516 0.123583 1.013543
C  -2.964347 -0.152851 -0.885469
C  -3.258254 0.041815 0.454326
H  0.922764 -0.017948 -1.73143
H  1.732017 -2.081246 -1.23677
H  0.697671 -2.240817 0.167152
H  2.356008 -1.384152 1.634759
H  3.469699 -1.956586 0.396712
H  3.49897 0.668801 1.052983
H  3.542894 0.23431 -0.661872
H  2.157497 2.742351 0.295701
H  0.564014 2.457532 -0.391013
H  2.008234 2.199318 -1.384947
H  -1.36253 -0.358436 -2.303853
H  -0.316192 0.256882 1.791789
H  -3.758938 -0.250821 -1.612533
H  -4.288306 0.092989 0.789585
totalener: -499.02213696 hartree
nucrepener: 702.28547020 hartree
electener: -1201.30760716 hartree
oneelecener: -2066.61353633 hartree
twoeener: 865.30592917 hartree
kineticenergy: 496.72636556 hartree
xcener: -50.247805553564 hartree
chargesum: -0.0000000
charge: -0.208525 -0.292017 0.115354 -0.111741 -0.142802 -0.075854 -0.042867 -0.182096 -0.160001 -0.016125 -0.113560 0.007273 0.064939 0.077705 0.082342 0.076536 0.073951 0.080056 0.060782 0.090388 0.098956 0.069336 0.108735 0.105537 0.119546 0.114152
qa: -0.2085 -0.2920 0.1154 -0.1117 -0.1428 -0.0759 -0.0429 -0.1821 -0.1600 -0.0161 -0.1136 0.0073 0.0649 0.0777 0.0823 0.0765 0.0740 0.0801 0.0608 0.0904 0.0990 0.0693 0.1087 0.1055 0.1195 0.1142
va: 2.9063 3.1032 3.7485 3.8809 3.9440 3.9586 3.5919 3.9582 4.0198 4.0811 3.9016 4.0265 1.0117 1.0143 1.0170 1.0155 1.0175 1.0018 1.0080 0.9976 0.9957 1.0060 1.0178 1.0450 1.0028 1.0018
dispcorr: -0.010076513 hartree
energy: -499.032213472198
dipole: 10.55942 -9.96374 0.59568 0.34079 -0.52721 -0.18642 -3.00150 2.05094 -0.95056
magnitude: 1.13717 au
magnitude: 2.89045 debye
