program: Orca
programVersion: 5.0.3
elementType: Cl O O N N N N N C C C C C C C C C H H H H H H H H H H
charge: 0
multiplicity: 1
keywords: wb97x-d3
keywords: def2-TZVPP
keywords: def2/J RIJCOSX
keywords: DEFGRID2
keywords: scfconv7
keywords: smallprint printgap noloewdin
keywords: NOSOSCF
formula: C9H10ClN5O2
InChI: InChI=1/C9H10ClN5O2/c10-8-2-1-7(5-12-8)6-14-4-3-11-9(14)13-15(16)17/h1-2,5,11H,3-4,6H2
27 atoms
Cl 4.39031 -1.44519 -0.564464
O  -3.354882 -1.629524 -0.639583
O  -2.204774 -2.622933 0.860545
N  -1.473296 1.724123 0.40515
N  -2.889045 0.929811 -1.068303
N  -1.852146 -0.516832 0.600124
N  2.695482 -0.55079 1.196659
N  -2.502891 -1.612617 0.244392
C  -1.738701 2.853383 -0.478577
C  -2.951868 2.369175 -1.267527
C  -0.321328 1.679131 1.27698
C  -2.108527 0.627113 -0.03428
C  0.84915 0.90704 0.727352
C  1.206346 0.913984 -0.617357
C  1.632576 0.148938 1.583398
C  2.304108 0.186261 -1.038308
C  3.005246 -0.521535 -0.075969
H  -0.882442 3.053834 -1.125967
H  -1.948807 3.754475 0.0945
H  -3.885138 2.768898 -0.868661
H  -2.891278 2.622461 -2.3229
H  -0.605907 1.267103 2.245709
H  -0.030078 2.714234 1.46137
H  -3.59945 0.297457 -1.396678
H  0.638881 1.473071 -1.35001
H  1.388119 0.094531 2.638292
H  2.600704 0.172375 -2.077097
elementType: Cl O N C H
totalener: -1233.39331678 hartree
nucrepener: 1317.40018334 hartree
electener: -2550.79350012 hartree
oneelecener: -4303.92306398 hartree
twoeener: 1753.12956386 hartree
cpcmener: -0.05701715 hartree
kineticenergy: 1229.69600630 hartree
xcener: -93.452758522651 hartree
chargesum: -0.0000000
charge: -0.092657 -0.478948 -0.469618 -0.140945 -0.180473 -0.350399 -0.333537 0.549377 -0.055006 -0.005387 0.065259 0.328081 -0.015165 -0.134075 -0.015726 -0.164946 0.192537 0.107048 0.115409 0.106039 0.101937 0.113401 0.122457 0.194221 0.156942 0.133497 0.150678
qa: -0.0927 -0.4789 -0.4696 -0.1409 -0.1805 -0.3504 -0.3335 0.5494 -0.0550 -0.0054 0.0653 0.3281 -0.0152 -0.1341 -0.0157 -0.1649 0.1925 0.1070 0.1154 0.1060 0.1019 0.1134 0.1225 0.1942 0.1569 0.1335 0.1507
va: 1.2095 1.7809 1.7718 3.2131 3.2894 2.7474 3.0414 4.3088 3.9176 3.9348 3.7771 4.2816 3.6401 3.9577 4.0938 3.9803 4.1197 0.9921 1.0032 1.0022 1.0045 1.0100 0.9941 1.0207 0.9975 1.0100 1.0030
dispcorr: -0.012050176 hartree
energy: -1233.405366956711
dipole: -14.51465 13.26827 -1.24639 18.69054 -12.76586 5.92468 -1.79798 0.10678 -1.69119
magnitude: 6.28613 au
magnitude: 15.97808 debye
